{"text_format":"1","workbook":"xlsx","n_sheets":15,"sheets":["Round_1","R_2","R_3","R_4","R_5","R_6","R_7","R_8","R_9","R_10","R_11","R_12","Totals","Data","Info"],"not_rendered":{"charts":0,"images":505,"macros":1,"external_links":1,"defined_names":32,"comments":0,"pivot_tables":0},"unopened":[],"bounds":{"document_bytes":16777216,"sheet_cells":100000,"rows_first":2000,"rows_last":500,"rows_between":2000,"halvings":0,"cell_chars":16384,"cell_head_chars":4096},"cells_cut":0,"cells_raw":0,"read":"whole","date_system":"1900"}

{"sheet":"Round_1","index":0,"n_rows":41,"n_cols":51,"rows_kept":41,"cut":false,"hidden":false,"merged":[[1,4,1,5],[44,2,44,7],[44,8,44,9],[45,2,45,7],[45,8,45,9],[41,2,41,7],[41,8,41,9],[42,2,42,7],[42,8,42,9],[43,2,43,7],[43,8,43,9],[38,2,38,7],[38,8,38,9],[39,2,39,7],[39,8,39,9],[40,2,40,7],[40,8,40,9],[35,2,35,7],[35,8,35,9],[36,2,36,7],[36,8,36,9],[37,2,37,7],[37,8,37,9],[0,6,1,7],[45,20,45,22],[40,20,40,22],[41,20,41,22],[42,20,42,22],[43,20,43,22],[44,20,44,22],[34,2,34,7],[34,8,34,9],[30,38,30,40],[31,2,31,7],[31,8,31,9],[31,12,31,15],[31,16,31,21],[31,22,31,23],[32,2,32,7],[32,8,32,9],[32,21,32,23],[33,2,33,7],[33,8,33,9],[39,12,39,15],[36,12,36,15],[37,12,37,15],[38,12,38,15],[25,31,25,32],[26,31,26,32],[27,31,28,32],[30,2,30,7],[30,8,30,9],[30,12,30,15],[30,16,30,21],[30,22,30,23],[30,25,31,30],[30,31,31,32],[6,16,6,19],[6,14,6,15],[6,8,6,10],[6,31,6,32],[4,25,5,26],[24,31,24,32],[12,31,12,32],[13,31,13,32],[14,31,14,32],[15,31,16,32],[19,31,19,32],[20,31,20,32],[21,31,21,32],[22,31,22,32],[23,31,23,32],[18,31,18,32],[18,14,18,15],[18,8,18,10],[11,31,11,32],[7,31,7,32],[8,31,8,32],[9,31,9,32],[10,31,10,32],[0,33,0,34],[1,33,1,34],[2,33,2,34],[3,33,3,34],[18,16,18,19],[4,27,4,29],[4,30,4,32],[4,34,4,36],[45,16,45,18],[40,16,40,18],[41,16,41,18],[42,16,42,18],[43,16,43,18],[44,16,44,18],[35,16,35,18],[35,20,35,25],[36,16,36,18],[37,16,37,18],[38,16,38,18],[39,16,39,18],[36,20,36,22],[37,20,37,22],[38,20,38,22],[39,20,39,22]]}
[null,"JBQ Round",1,null,null,null,0,null,5,null,null,null,null,null,null,null,null,null,null,null,null,null,null,null,null,null,null,null,null,null,null,null,null,"Coach Help",null,"10's","20's","30's","Points","Negs","Red",null,"SetC",null,null,null,null,null,null,"Cleared"]
[null,"JBQ Room",null,null,"Stop",null,null,null,null,null,null,null,null,null,null,null,null,null,null,null,null,null,null,null,null,null,null,null,null,null,null,null,null,"Asked",null,{"$f":"COUNTIF($C6:$Y6,10)","v":0},{"$f":"COUNTIF($C6:$Y6,20)","v":0},{"$f":"COUNTIF($C6:$Y6,30)","v":0},{"$f":"(AJ2*10)+(AK2*20)+(AL2*30)","v":0},{"$f":"(AJ2*-5)+(AK2*-10)+(AL2*-15)","v":0},null,null,null,null,null,null,null,null,null,null,"Sounds\\tada.wav"]
[null,"JBQ Division",null,null,null,null,null,null,null,null,null,null,null,null,null,null,null,null,null,null,null,null,null,null,null,null,null,null,null,null,null,null,null,"Max",null,10,7,3,{"$f":"(AJ3*10)+(AK3*20)+(AL3*30)","v":330},{"$f":"(AJ3*-5)+(AK3*-10)+(AL3*-15)","v":-165},0,null,null,null,null,null,null,null,null,"Wave Play"]
[null,"Interrupt",null,null,null,null,null,null,null,null,null,null,null,null,null,null,null,null,null,null,null,null,null,null,null,null,null,null,null,null,null,null,null,"Remaining",null,{"$f":"AJ3-AJ2","v":10},{"$f":"AK3-AK2","v":7},{"$f":"AL3-AL2","v":3},{"$f":"(AJ4*10)+(AK4*20)+(AL4*30)","v":330},{"$f":"(AJ4*-5)+(AK4*-10)+(AL4*-15)","v":-165},0,null,null,null,null,null,null,null,null,"Sounds\\tada.wav"]
[0,"Question Number",1,{"$f":"C5+1","v":2},{"$f":"D5+1","v":3},4,5,6,7,8,9,10,11,12,13,14,15,16,17,18,19,20,"ot1","ot2","ot3",0,null,"Time Start",null,null,"22:32:51",null,null,"Now","22:32:53",null,null,null,null,null,null,null,null,null,null,null,null,null,null,"Wave No File"]
[null,"Point Value ",null,null,null,null,null,null,null,null,null,null,null,null,null,null,null,null,null,null,null,null,null,null,null,null,null,null,null,"Cnt","Cnt",null,null,null,"Cnt","Cnt","Cnt","Cnt","Cnt","Cnt",null,null,null,null,null,null,null,null,null,"C:\\AA\\CedarPark\\JBQ1\\Sounds\\tada.wav"]
[null,"Red Team",null,null,null,null,null,null,"Time-Outs  ",null,null,1,2,3,null,null,"Coach Appeals",null,null,null,1,2,null,null,null,"Fouls","Bonus","Total",null,"Oks","Not","Outs",null,"Rank","10's","20's","30's","-5's","-10's","-15's",null,null,"Neg",null,null,null,null,null,null,"Wave Playing"]
[1,"Quiz-1",null,null,null,null,null,null,null,null,null,null,null,null,null,null,null,null,null,null,null,null,null,null,null,null,{"$f":"IF(AD8>5,10,\"\")","v":""},{"$f":"SUM(C8:AA8)","v":0},null,{"$f":"COUNTIF(C8:Y8,10)+COUNTIF(C8:Y8,20)+COUNTIF(C8:Y8,30)","v":0},{"$f":"COUNTIF(C8:Y8,-5)+COUNTIF(C8:Y8,-10)+COUNTIF(C8:Y8,-15)","v":0},{"$f":"IF(AD8>Data!$J$4,Data!$J$3,IF(AE8>Data!$K$4,Data!$K$3,\" \"))","v":" "},null,{"$f":"RANK(AB8,(AB8:AB15,AB20:AB27),0)","v":1},{"$f":"COUNTIF(C8:Y8,10)","v":0},{"$f":"COUNTIF(C8:Y8,20)","v":0},{"$f":"COUNTIF(C8:Y8,30)","v":0},{"$f":"COUNTIF(C8:Y8,-5)","v":0},{"$f":"COUNTIF(C8:Y8,-10)","v":0},{"$f":"COUNTIF(C8:Y8,-15)","v":0},null,null,"Plus",5,null,null,null,null,null,"Wave Waiting"]
[null,null,null,null,null,null,null,null,null,null,null,null,null,null,null,null,null,null,null,null,null,null,null,null,null,null,{"$f":"IF(AD9>5,10,\"\")","v":""},{"$f":"SUM(C9:AA9)","v":0},null,{"$f":"COUNTIF(C9:Y9,10)+COUNTIF(C9:Y9,20)+COUNTIF(C9:Y9,30)","v":0},{"$f":"COUNTIF(C9:Y9,-5)+COUNTIF(C9:Y9,-10)+COUNTIF(C9:Y9,-15)","v":0},{"$f":"IF(AD9>Data!$J$4,Data!$J$3,IF(AE9>Data!$K$4,Data!$K$3,\" \"))","v":" "},null,{"$f":"RANK(AB9,(AB8:AB15,AB20:AB27),0)","v":1},{"$f":"COUNTIF(C9:Y9,10)","v":0},{"$f":"COUNTIF(C9:Y9,20)","v":0},{"$f":"COUNTIF(C9:Y9,30)","v":0},{"$f":"COUNTIF(C9:Y9,-5)","v":0},{"$f":"COUNTIF(C9:Y9,-10)","v":0},{"$f":"COUNTIF(C9:Y9,-15)","v":0},null,null,"Quiz-Out",4,null,null,null,null,null,"Wave Ending"]
[2,"Quiz-2",null,null,null,null,null,null,null,null,null,null,null,null,null,null,null,null,null,null,null,null,null,null,null,null,"",{"$f":"SUM(C10:AA10)","v":0},null,0,0,{"$f":"IF(AD10>Data!$J$4,Data!$J$3,IF(AE10>Data!$K$4,Data!$K$3,\" \"))","v":" "},null,{"$f":"RANK(AB10,(AB8:AB15,AB20:AB27),0)","v":1},0,0,0,0,0,0,null,null,"Minus",1]
[" ",null,null,null,null,null,null,null,null,null,null,null,null,null,null,null,null,null,null,null,null,null,null,null,null,null,"",{"$f":"SUM(C11:AA11)","v":0},null,0,0,{"$f":"IF(AD11>Data!$J$4,Data!$J$3,IF(AE11>Data!$K$4,Data!$K$3,\" \"))","v":" "},null,{"$f":"RANK(AB11,(AB8:AB15,AB20:AB27),0)","v":1},0,0,0,0,0,0,null,null,"Fizz-Out",2]
[3,"Quiz-3",null,null,null,null,null,null,null,null,null,null,null,null,null,null,null,null,null,null,null,null,null,null,null,null,"",0,null,0,0,{"$f":"IF(AD12>Data!$J$4,Data!$J$3,IF(AE12>Data!$K$4,Data!$K$3,\" \"))","v":" "},null,{"$f":"RANK(AB12,(AB8:AB15,AB20:AB27),0)","v":1},0,0,0,0,0,0,null,null,"Time-Start"]
[" ",null,null,null,null,null,null,null,null,null,null,null,null,null,null,null,null,null,null,null,null,null,null,null,null,null,"",0,null,0,0,{"$f":"IF(AD13>Data!$J$4,Data!$J$3,IF(AE13>Data!$K$4,Data!$K$3,\" \"))","v":" "},null,{"$f":"RANK(AB13,(AB8:AB15,AB20:AB27),0)","v":1},0,0,0,0,0,0,null,null,"Time-Stop"]
[4,"Quiz-4",null,null,null,null,null,null,null,null,null,null,null,null,null,null,null,null,null,null,null,null,null,null,null,null,"",0,null,0,0,{"$f":"IF(AD14>Data!$J$4,Data!$J$3,IF(AE14>Data!$K$4,Data!$K$3,\" \"))","v":" "},null,{"$f":"RANK(AB14,(AB8:AB15,AB20:AB27),0)","v":1},0,0,0,0,0,0,null,null,"Time-End"]
[" ",null,null,null,null,null,null,null,null,null,null,null,null,null,null,null,null,null,null,null,null,null,null,null,null,null,"",0,null,0,0,{"$f":"IF(AD15>Data!$J$4,Data!$J$3,IF(AE15>Data!$K$4,Data!$K$3,\" \"))","v":" "},null,{"$f":"RANK(AB15,(AB8:AB15,AB20:AB27),0)","v":1},0,0,0,0,0,0,null,null,"Sound-On",null,null,null,null,null,null,"22:34:16"]
[" ","Team Fouls",null,null,null,null,null,null,null,null,null,null,null,null,null,null,null,null,null,null,null,null,null,null,null,null,null,0,null,null,null,{"$f":"AB17","v":0}]
[null,"Running Total",{"$f":"SUM(C8:C16)","v":0},{"$f":"C17+SUM(D8:D16)","v":0},0,0,0,0,0,0,0,0,0,{"$f":"M17+SUM(N8:N16)","v":0},0,0,0,0,0,0,0,0,{"$f":"V17+SUM(W8:W16)","v":0},{"$f":"W17+SUM(X8:X16)","v":0},{"$f":"X17+SUM(Y8:Y16)","v":0},{"$f":"X17+SUM(Z8:Z16)","v":0},{"$f":"Z17+SUM(AA8:AA16)","v":0},{"$f":"SUM(AB8:AB16)","v":0},null,{"$f":"SUM(AD8:AD16)","v":0},{"$f":"SUM(AE8:AE16)","v":0},null,null,null,{"$f":"SUM(AI8:AI15)","v":0},0,0,0,0,0]
[]
[null,"Green Team",null,null,null,null,null,null,"Time-Outs  ",null,null,1,2,3,null,null,"Coach Appeals",null,null,null,1,2,null,null,null,"Fouls","Bonus","Total",null,"Oks","Not","Outs"]
[1,"Quizzer-5",null,null,null,null,null,null,null,null,null,null,null,null,null,null,null,null,null,null,null,null,null,null,null,null,{"$f":"IF(AD20>5,10,\"\")","v":""},{"$f":"SUM(C20:AA20)","v":0},null,{"$f":"COUNTIF(C20:Y20,10)+COUNTIF(C20:Y20,20)+COUNTIF(C20:Y20,30)","v":0},{"$f":"COUNTIF(C20:Y20,-5)+COUNTIF(C20:Y20,-10)+COUNTIF(C20:Y20,-15)","v":0},{"$f":"IF(AD20>Data!$J$4,Data!$J$3,IF(AE20>Data!$K$4,Data!$K$3,\" \"))","v":" "},null,{"$f":"RANK(AB20,(AB8:AB15,AB20:AB27),0)","v":1},{"$f":"COUNTIF(C20:Y20,10)","v":0},{"$f":"COUNTIF(C20:Y20,20)","v":0},0,0,0,{"$f":"COUNTIF(C20:Y20,-15)","v":0}]
[null,null,null,null,null,null,null,null,null,null,null,null,null,null,null,null,null,null,null,null,null,null,null,null,null,null,{"$f":"IF(AD21>5,10,\"\")","v":""},0,null,0,0,{"$f":"IF(AD21>Data!$J$4,Data!$J$3,IF(AE21>Data!$K$4,Data!$K$3,\" \"))","v":" "},null,{"$f":"RANK(AB21,(AB8:AB15,AB20:AB27),0)","v":1},0,0,{"$f":"COUNTIF(C21:Y21,30)","v":0},0,0,0]
[2,"Quizzer-6",null,null,null,null,null,null,null,null,null,null,null,null,null,null,null,null,null,null,null,null,null,null,null,null,"",0,null,0,0,{"$f":"IF(AD22>Data!$J$4,Data!$J$3,IF(AE22>Data!$K$4,Data!$K$3,\" \"))","v":" "},null,{"$f":"RANK(AB22,(AB8:AB15,AB20:AB27),0)","v":1},0,0,0,{"$f":"COUNTIF(C22:Y22,-5)","v":0},{"$f":"COUNTIF(C22:Y22,-10)","v":0},0]
[" ",null,null,null,null,null,null,null,null,null,null,null,null,null,null,null,null,null,null,null,null,null,null,null,null,null,"",0,null,0,0,{"$f":"IF(AD23>Data!$J$4,Data!$J$3,IF(AE23>Data!$K$4,Data!$K$3,\" \"))","v":" "},null,{"$f":"RANK(AB23,(AB8:AB15,AB20:AB27),0)","v":1},0,0,0,0,0,0]
[3,"Quizzer-7",null,null,null,null,null,null,null,null,null,null,null,null,null,null,null,null,null,null,null,null,null,null,null,null,"",0,null,0,0,{"$f":"IF(AD24>Data!$J$4,Data!$J$3,IF(AE24>Data!$K$4,Data!$K$3,\" \"))","v":" "},null,{"$f":"RANK(AB24,(AB8:AB15,AB20:AB27),0)","v":1},0,0,0,0,0,0]
[" ",null,null,null,null,null,null,null,null,null,null,null,null,null,null,null,null,null,null,null,null,null,null,null,null,null,"",0,null,0,0,{"$f":"IF(AD25>Data!$J$4,Data!$J$3,IF(AE25>Data!$K$4,Data!$K$3,\" \"))","v":" "},null,{"$f":"RANK(AB25,(AB8:AB15,AB20:AB27),0)","v":1},0,0,0,0,0,0]
[4,"Quizzer-8",null,null,null,null,null,null,null,null,null,null,null,null,null,null,null,null,null,null,null,null,null,null,null,null,"",0,null,0,0,{"$f":"IF(AD26>Data!$J$4,Data!$J$3,IF(AE26>Data!$K$4,Data!$K$3,\" \"))","v":" "},null,{"$f":"RANK(AB26,(AB8:AB15,AB20:AB27),0)","v":1},0,0,0,0,0,0]
[null,null,null,null,null,null,null,null,null,null,null,null,null,null,null,null,null,null,null,null,null,null,null,null,null,null,"",{"$f":"SUM(C27:AA27)","v":0},null,0,0,{"$f":"IF(AD27>Data!$J$4,Data!$J$3,IF(AE27>Data!$K$4,Data!$K$3,\" \"))","v":" "},null,{"$f":"RANK(AB27,(AB8:AB15,AB20:AB27),0)","v":1},0,0,0,0,0,0]
[" ","Team Fouls",null,null,null,null,null,null,null,null,null,null,null,null,null,null,null,null,null,null,null,null,null,null,null,null,null,0,null,"f",null,{"$f":"AB29","v":0}]
[null,"Running Total",{"$f":"SUM(C20:C28)","v":0},{"$f":"C29+SUM(D20:D28)","v":0},0,0,0,0,0,0,0,0,0,0,0,0,0,0,0,0,0,0,0,0,0,0,0,{"$f":"SUM(AB20:AB28)","v":0},null,{"$f":"SUM(AD20:AD28)","v":0},{"$f":"SUM(AE20:AE28)","v":0},null,null,null,{"$f":"SUM(AI20:AI27)","v":0},0,0,0,0,0]
[]
[null," ","   No Scores",null,null,null,null,null,null,null,null,null,"1st Place Team : ",null,null,null,{"$f":"IF(AD17>=AD29,B7,B19)","v":"Red Team"},null,null,null,null,null,"Score : ",null,{"$f":"MAXA(AB17,AB29)","v":0},"Score Difference:",null,null,null,null,null,{"$f":"IF(AB17>AB29,AB17-AB29,AB29-AB17)","v":0},null," ",null,null,null,null,"Not Clear"]
[null,null,null,null,null,null,null,null,null,null,null,null,"2nd Place Team : ",null,null,null,{"$f":"IF(AD17>=AD29,B19,B7)","v":"Green Team"},null,null,null,null,null,"Score : ",null,{"$f":"MINA(AB17,AB29)","v":0}]
[null,null,null,null,null,null,null,null,null,null,null,null,null,null,null,null,null,null,null,null,null,"Difference : ",null,null,{"$f":"Y31-Y32","v":0}]
[]
[]
[null,null,null,null,null,null,null,null,null,null,null,null,null,null,null,null,null,null,null,null,"Sun  21-Apr-2013  10:34:16 PM"]
[null,null,null,null,null,null,null,null,null,null,null,null,"Timer Start",null,null,null,"22:32:51",null,null,null,"Foul Time",null,null,"Foul#","Q#","Foul",null,"User"]
[null,null,null,null,null,null,null,null,null,null,null,null,"Timer Now",null,null,null,"22:34:16"]
[null,null,null,null,null,null,null,null,null,null,null,null,"Timer End  ",null,null,null," "]
[null,null,null,null,null,null,null,null,null,null,null,null,"Timer Stop ",null,null,null,"22:32:52"]
[null,null,null,null,null,null,null,null,null,null,null,null,null,null,null,null,"22:32:45"]

{"sheet":"R_2","index":1,"n_rows":41,"n_cols":51,"rows_kept":41,"cut":false,"hidden":false,"merged":[[1,4,1,5],[1,33,1,34],[2,33,2,34],[3,33,3,34],[4,25,5,26],[4,27,4,29],[4,30,4,32],[4,34,4,36],[6,8,6,10],[6,14,6,15],[6,16,6,19],[6,31,6,32],[0,6,1,7],[0,33,0,34],[18,8,18,10],[18,14,18,15],[18,16,18,19],[18,31,18,32],[7,31,7,32],[8,31,8,32],[9,31,9,32],[10,31,10,32],[11,31,11,32],[12,31,12,32],[19,31,19,32],[20,31,20,32],[21,31,21,32],[22,31,22,32],[23,31,23,32],[24,31,24,32],[13,31,13,32],[14,31,14,32],[15,31,16,32],[25,31,25,32],[26,31,26,32],[27,31,28,32],[30,2,30,7],[30,8,30,9],[30,12,30,15],[30,16,30,21],[30,22,30,23],[30,25,31,30],[30,31,31,32],[32,2,32,7],[32,8,32,9],[32,21,32,23],[33,2,33,7],[33,8,33,9],[34,2,34,7],[34,8,34,9],[30,38,30,40],[31,2,31,7],[31,8,31,9],[31,12,31,15],[31,16,31,21],[31,22,31,23],[35,2,35,7],[35,8,35,9],[35,16,35,18],[35,20,35,25],[36,2,36,7],[36,8,36,9],[36,12,36,15],[36,16,36,18],[36,20,36,22],[37,2,37,7],[37,8,37,9],[37,12,37,15],[37,16,37,18],[37,20,37,22],[38,2,38,7],[38,8,38,9],[38,12,38,15],[38,16,38,18],[38,20,38,22],[41,2,41,7],[41,8,41,9],[41,16,41,18],[41,20,41,22],[42,2,42,7],[42,8,42,9],[42,16,42,18],[42,20,42,22],[39,2,39,7],[39,8,39,9],[39,12,39,15],[39,16,39,18],[39,20,39,22],[40,2,40,7],[40,8,40,9],[40,16,40,18],[40,20,40,22],[45,2,45,7],[45,8,45,9],[45,16,45,18],[45,20,45,22],[43,2,43,7],[43,8,43,9],[43,16,43,18],[43,20,43,22],[44,2,44,7],[44,8,44,9],[44,16,44,18],[44,20,44,22]]}
[null,"JBQ Round",2,null,null,null,0,null,30,null,null,null,null,null,null,null,null,null,null,null,null,null,null,null,null,null,null,null,null,null,null,null,null,"Coach Help",null,"10's","20's","30's","Points","Negs","Red",null,"SetC",null,null,null,null,null,null,"Cleared"]
[null,"JBQ Room",null,null,"Stop",null,null,null,null,null,null,null,null,null,null,null,null,null,null,null,null,null,null,null,null,null,null,null,null,null,null,null,null,"Asked",null,{"$f":"COUNTIF($C6:$Y6,10)","v":0},{"$f":"COUNTIF($C6:$Y6,20)","v":0},{"$f":"COUNTIF($C6:$Y6,30)","v":0},{"$f":"(AJ2*10)+(AK2*20)+(AL2*30)","v":0},{"$f":"(AJ2*-5)+(AK2*-10)+(AL2*-15)","v":0},null,null,null,null,null,null,null,null,null,null,"Sounds\\tada.wav"]
[null,"JBQ Division",null,null,null,null,null,null,null,null,null,null,null,null,null,null,null,null,null,null,null,null,null,null,null,null,null,null,null,null,null,null,null,"Max",null,10,7,3,{"$f":"(AJ3*10)+(AK3*20)+(AL3*30)","v":330},{"$f":"(AJ3*-5)+(AK3*-10)+(AL3*-15)","v":-165},0,null,null,null,null,null,null,null,null,"Wave Play"]
[null,"Interrupt",null,null,null,null,null,null,null,null,null,null,null,null,null,null,null,null,null,null,null,null,null,null,null,null,null,null,null,null,null,null,null,"Remaining",null,{"$f":"AJ3-AJ2","v":10},{"$f":"AK3-AK2","v":7},{"$f":"AL3-AL2","v":3},{"$f":"(AJ4*10)+(AK4*20)+(AL4*30)","v":330},{"$f":"(AJ4*-5)+(AK4*-10)+(AL4*-15)","v":-165},0,null,null,null,null,null,null,null,null,"Sounds\\tada.wav"]
[0,"Question Number",1,{"$f":"C5+1","v":2},{"$f":"D5+1","v":3},4,5,6,7,8,9,10,11,12,13,14,15,16,17,18,19,20,"ot1","ot2","ot3",0,null,"Time Start",null,null,"00:07:30",null,null,"Now","00:07:33",null,null,null,null,null,null,null,null,null,null,null,null,null,null,"Wave No File"]
[null,"Point Value ",null,null,null,null,null,null,null,null,null,null,null,null,null,null,null,null,null,null,null,null,null,null,null,null,null,null,null,"Cnt","Cnt",null,null,null,"Cnt","Cnt","Cnt","Cnt","Cnt","Cnt",null,null,null,null,null,null,null,null,null,"C:\\AA\\CedarPark\\JBQ1\\Sounds\\tada.wav"]
[null,"Red Team",null,null,null,null,null,null,"Time-Outs  ",null,null,1,2,3,null,null,"Coach Appeals",null,null,null,1,2,null,null,null,"Fouls","Bonus","Total",null,"Oks","Not","Outs",null,"Rank","10's","20's","30's","-5's","-10's","-15's",null,null,"Neg",null,null,null,null,null,null,"Wave Playing"]
[1,"Quiz-1",null,null,null,null,null,null,null,null,null,null,null,null,null,null,null,null,null,null,null,null,null,null,null,null,{"$f":"IF(AD8>5,10,\"\")","v":""},{"$f":"SUM(C8:AA8)","v":0},null,{"$f":"COUNTIF(C8:Y8,10)+COUNTIF(C8:Y8,20)+COUNTIF(C8:Y8,30)","v":0},{"$f":"COUNTIF(C8:Y8,-5)+COUNTIF(C8:Y8,-10)+COUNTIF(C8:Y8,-15)","v":0},{"$f":"IF(AD8>Data!$J$4,Data!$J$3,IF(AE8>Data!$K$4,Data!$K$3,\" \"))","v":" "},null,{"$f":"RANK(AB8,(AB8:AB15,AB20:AB27),0)","v":1},{"$f":"COUNTIF(C8:Y8,10)","v":0},{"$f":"COUNTIF(C8:Y8,20)","v":0},{"$f":"COUNTIF(C8:Y8,30)","v":0},{"$f":"COUNTIF(C8:Y8,-5)","v":0},{"$f":"COUNTIF(C8:Y8,-10)","v":0},{"$f":"COUNTIF(C8:Y8,-15)","v":0},null,null,"Plus",5,null,null,null,null,null,"Wave Waiting"]
[null,null,null,null,null,null,null,null,null,null,null,null,null,null,null,null,null,null,null,null,null,null,null,null,null,null,{"$f":"IF(AD9>5,10,\"\")","v":""},{"$f":"SUM(C9:AA9)","v":0},null,{"$f":"COUNTIF(C9:Y9,10)+COUNTIF(C9:Y9,20)+COUNTIF(C9:Y9,30)","v":0},{"$f":"COUNTIF(C9:Y9,-5)+COUNTIF(C9:Y9,-10)+COUNTIF(C9:Y9,-15)","v":0},{"$f":"IF(AD9>Data!$J$4,Data!$J$3,IF(AE9>Data!$K$4,Data!$K$3,\" \"))","v":" "},null,{"$f":"RANK(AB9,(AB8:AB15,AB20:AB27),0)","v":1},{"$f":"COUNTIF(C9:Y9,10)","v":0},{"$f":"COUNTIF(C9:Y9,20)","v":0},{"$f":"COUNTIF(C9:Y9,30)","v":0},{"$f":"COUNTIF(C9:Y9,-5)","v":0},{"$f":"COUNTIF(C9:Y9,-10)","v":0},{"$f":"COUNTIF(C9:Y9,-15)","v":0},null,null,"Quiz-Out",4,null,null,null,null,null,"Wave Ending"]
[2,"Quiz-2",null,null,null,null,null,null,null,null,null,null,null,null,null,null,null,null,null,null,null,null,null,null,null,null,"",{"$f":"SUM(C10:AA10)","v":0},null,0,0,{"$f":"IF(AD10>Data!$J$4,Data!$J$3,IF(AE10>Data!$K$4,Data!$K$3,\" \"))","v":" "},null,{"$f":"RANK(AB10,(AB8:AB15,AB20:AB27),0)","v":1},0,0,0,0,0,0,null,null,"Minus",1]
[" ",null,null,null,null,null,null,null,null,null,null,null,null,null,null,null,null,null,null,null,null,null,null,null,null,null,"",{"$f":"SUM(C11:AA11)","v":0},null,0,0,{"$f":"IF(AD11>Data!$J$4,Data!$J$3,IF(AE11>Data!$K$4,Data!$K$3,\" \"))","v":" "},null,{"$f":"RANK(AB11,(AB8:AB15,AB20:AB27),0)","v":1},0,0,0,0,0,0,null,null,"Fizz-Out",2]
[3,"Quiz-3",null,null,null,null,null,null,null,null,null,null,null,null,null,null,null,null,null,null,null,null,null,null,null,null,"",0,null,0,0,{"$f":"IF(AD12>Data!$J$4,Data!$J$3,IF(AE12>Data!$K$4,Data!$K$3,\" \"))","v":" "},null,{"$f":"RANK(AB12,(AB8:AB15,AB20:AB27),0)","v":1},0,0,0,0,0,0,null,null,"Time-Start"]
[" ",null,null,null,null,null,null,null,null,null,null,null,null,null,null,null,null,null,null,null,null,null,null,null,null,null,"",0,null,0,0,{"$f":"IF(AD13>Data!$J$4,Data!$J$3,IF(AE13>Data!$K$4,Data!$K$3,\" \"))","v":" "},null,{"$f":"RANK(AB13,(AB8:AB15,AB20:AB27),0)","v":1},0,0,0,0,0,0,null,null,"Time-Stop"]
[4,"Quiz-4",null,null,null,null,null,null,null,null,null,null,null,null,null,null,null,null,null,null,null,null,null,null,null,null,"",0,null,0,0,{"$f":"IF(AD14>Data!$J$4,Data!$J$3,IF(AE14>Data!$K$4,Data!$K$3,\" \"))","v":" "},null,{"$f":"RANK(AB14,(AB8:AB15,AB20:AB27),0)","v":1},0,0,0,0,0,0,null,null,"Time-End"]
[" ",null,null,null,null,null,null,null,null,null,null,null,null,null,null,null,null,null,null,null,null,null,null,null,null,null,"",0,null,0,0,{"$f":"IF(AD15>Data!$J$4,Data!$J$3,IF(AE15>Data!$K$4,Data!$K$3,\" \"))","v":" "},null,{"$f":"RANK(AB15,(AB8:AB15,AB20:AB27),0)","v":1},0,0,0,0,0,0,null,null,"Sound-On",null,null,null,null,null,null,"21:32:40"]
[" ","Team Fouls",null,null,null,null,null,null,null,null,null,null,null,null,null,null,null,null,null,null,null,null,null,null,null,null,null,0,null,null,null,{"$f":"AB17","v":0}]
[null,"Running Total",{"$f":"SUM(C8:C16)","v":0},{"$f":"C17+SUM(D8:D16)","v":0},0,0,0,0,0,0,0,0,0,{"$f":"M17+SUM(N8:N16)","v":0},0,0,0,0,0,0,0,0,{"$f":"V17+SUM(W8:W16)","v":0},{"$f":"W17+SUM(X8:X16)","v":0},{"$f":"X17+SUM(Y8:Y16)","v":0},{"$f":"X17+SUM(Z8:Z16)","v":0},{"$f":"Z17+SUM(AA8:AA16)","v":0},{"$f":"SUM(AB8:AB16)","v":0},null,{"$f":"SUM(AD8:AD16)","v":0},{"$f":"SUM(AE8:AE16)","v":0},null,null,null,{"$f":"SUM(AI8:AI15)","v":0},0,0,0,0,0]
[]
[null,"Green Team",null,null,null,null,null,null,"Time-Outs  ",null,null,1,2,3,null,null,"Coach Appeals",null,null,null,1,2,null,null,null,"Fouls","Bonus","Total",null,"Oks","Not","Outs"]
[1,"Quizzer-5",null,null,null,null,null,null,null,null,null,null,null,null,null,null,null,null,null,null,null,null,null,null,null,null,{"$f":"IF(AD20>5,10,\"\")","v":""},{"$f":"SUM(C20:AA20)","v":0},null,{"$f":"COUNTIF(C20:Y20,10)+COUNTIF(C20:Y20,20)+COUNTIF(C20:Y20,30)","v":0},{"$f":"COUNTIF(C20:Y20,-5)+COUNTIF(C20:Y20,-10)+COUNTIF(C20:Y20,-15)","v":0},{"$f":"IF(AD20>Data!$J$4,Data!$J$3,IF(AE20>Data!$K$4,Data!$K$3,\" \"))","v":" "},null,{"$f":"RANK(AB20,(AB8:AB15,AB20:AB27),0)","v":1},{"$f":"COUNTIF(C20:Y20,10)","v":0},{"$f":"COUNTIF(C20:Y20,20)","v":0},0,0,0,{"$f":"COUNTIF(C20:Y20,-15)","v":0}]
[null,null,null,null,null,null,null,null,null,null,null,null,null,null,null,null,null,null,null,null,null,null,null,null,null,null,{"$f":"IF(AD21>5,10,\"\")","v":""},0,null,0,0,{"$f":"IF(AD21>Data!$J$4,Data!$J$3,IF(AE21>Data!$K$4,Data!$K$3,\" \"))","v":" "},null,{"$f":"RANK(AB21,(AB8:AB15,AB20:AB27),0)","v":1},0,0,{"$f":"COUNTIF(C21:Y21,30)","v":0},0,0,0]
[2,"Quizzer-6",null,null,null,null,null,null,null,null,null,null,null,null,null,null,null,null,null,null,null,null,null,null,null,null,"",0,null,0,0,{"$f":"IF(AD22>Data!$J$4,Data!$J$3,IF(AE22>Data!$K$4,Data!$K$3,\" \"))","v":" "},null,{"$f":"RANK(AB22,(AB8:AB15,AB20:AB27),0)","v":1},0,0,0,{"$f":"COUNTIF(C22:Y22,-5)","v":0},{"$f":"COUNTIF(C22:Y22,-10)","v":0},0]
[" ",null,null,null,null,null,null,null,null,null,null,null,null,null,null,null,null,null,null,null,null,null,null,null,null,null,"",0,null,0,0,{"$f":"IF(AD23>Data!$J$4,Data!$J$3,IF(AE23>Data!$K$4,Data!$K$3,\" \"))","v":" "},null,{"$f":"RANK(AB23,(AB8:AB15,AB20:AB27),0)","v":1},0,0,0,0,0,0]
[3,"Quizzer-7",null,null,null,null,null,null,null,null,null,null,null,null,null,null,null,null,null,null,null,null,null,null,null,null,"",0,null,0,0,{"$f":"IF(AD24>Data!$J$4,Data!$J$3,IF(AE24>Data!$K$4,Data!$K$3,\" \"))","v":" "},null,{"$f":"RANK(AB24,(AB8:AB15,AB20:AB27),0)","v":1},0,0,0,0,0,0]
[" ",null,null,null,null,null,null,null,null,null,null,null,null,null,null,null,null,null,null,null,null,null,null,null,null,null,"",0,null,0,0,{"$f":"IF(AD25>Data!$J$4,Data!$J$3,IF(AE25>Data!$K$4,Data!$K$3,\" \"))","v":" "},null,{"$f":"RANK(AB25,(AB8:AB15,AB20:AB27),0)","v":1},0,0,0,0,0,0]
[4,"Quizzer-8",null,null,null,null,null,null,null,null,null,null,null,null,null,null,null,null,null,null,null,null,null,null,null,null,"",0,null,0,0,{"$f":"IF(AD26>Data!$J$4,Data!$J$3,IF(AE26>Data!$K$4,Data!$K$3,\" \"))","v":" "},null,{"$f":"RANK(AB26,(AB8:AB15,AB20:AB27),0)","v":1},0,0,0,0,0,0]
[null,null,null,null,null,null,null,null,null,null,null,null,null,null,null,null,null,null,null,null,null,null,null,null,null,null,"",{"$f":"SUM(C27:AA27)","v":0},null,0,0,{"$f":"IF(AD27>Data!$J$4,Data!$J$3,IF(AE27>Data!$K$4,Data!$K$3,\" \"))","v":" "},null,{"$f":"RANK(AB27,(AB8:AB15,AB20:AB27),0)","v":1},0,0,0,0,0,0]
[" ","Team Fouls",null,null,null,null,null,null,null,null,null,null,null,null,null,null,null,null,null,null,null,null,null,null,null,null,null,0,null,"f",null,{"$f":"AB29","v":0}]
[null,"Running Total",{"$f":"SUM(C20:C28)","v":0},{"$f":"C29+SUM(D20:D28)","v":0},0,0,0,0,0,0,0,0,0,0,0,0,0,0,0,0,0,0,0,0,0,0,0,{"$f":"SUM(AB20:AB28)","v":0},null,{"$f":"SUM(AD20:AD28)","v":0},{"$f":"SUM(AE20:AE28)","v":0},null,null,null,{"$f":"SUM(AI20:AI27)","v":0},0,0,0,0,0]
[]
[null," ","   No Scores",null,null,null,null,null,null,null,null,null,"1st Place Team : ",null,null,null,{"$f":"IF(AD17>=AD29,B7,B19)","v":"Red Team"},null,null,null,null,null,"Score : ",null,{"$f":"MAXA(AB17,AB29)","v":0},"Score Difference:",null,null,null,null,null,{"$f":"IF(AB17>AB29,AB17-AB29,AB29-AB17)","v":0},null," ",null,null,null,null,"Not Clear"]
[null,null,null,null,null,null,null,null,null,null,null,null,"2nd Place Team : ",null,null,null,{"$f":"IF(AD17>=AD29,B19,B7)","v":"Green Team"},null,null,null,null,null,"Score : ",null,{"$f":"MINA(AB17,AB29)","v":0}]
[null,null,null,null,null,null,null,null,null,null,null,null,null,null,null,null,null,null,null,null,null,"Difference : ",null,null,{"$f":"Y31-Y32","v":0}]
[]
[]
[]
[null,null,null,null,null,null,null,null,null,null,null,null,"Timer Start",null,null,null,"00:07:30",null,null,null,"Foul Time",null,null,"Foul#","Q#","Foul",null,"User"]
[null,null,null,null,null,null,null,null,null,null,null,null,"Timer Now"]
[null,null,null,null,null,null,null,null,null,null,null,null,"Timer End  ",null,null,null," "]
[null,null,null,null,null,null,null,null,null,null,null,null,"Timer Stop ",null,null,null,"00:07:32"]
[null,null,null,null,null,null,null,null,null,null,null,null,null,null,null,null,"21:32:42"]

{"sheet":"R_3","index":2,"n_rows":41,"n_cols":51,"rows_kept":41,"cut":false,"hidden":false,"merged":[[1,4,1,5],[1,33,1,34],[2,33,2,34],[3,33,3,34],[4,25,5,26],[4,27,4,29],[4,30,4,32],[4,34,4,36],[6,8,6,10],[6,14,6,15],[6,16,6,19],[6,31,6,32],[0,6,1,7],[0,33,0,34],[18,8,18,10],[18,14,18,15],[18,16,18,19],[18,31,18,32],[7,31,7,32],[8,31,8,32],[9,31,9,32],[10,31,10,32],[11,31,11,32],[12,31,12,32],[19,31,19,32],[20,31,20,32],[21,31,21,32],[22,31,22,32],[23,31,23,32],[24,31,24,32],[13,31,13,32],[14,31,14,32],[15,31,16,32],[25,31,25,32],[26,31,26,32],[27,31,28,32],[30,2,30,7],[30,8,30,9],[30,12,30,15],[30,16,30,21],[30,22,30,23],[30,25,31,30],[30,31,31,32],[32,2,32,7],[32,8,32,9],[32,21,32,23],[33,2,33,7],[33,8,33,9],[34,2,34,7],[34,8,34,9],[30,38,30,40],[31,2,31,7],[31,8,31,9],[31,12,31,15],[31,16,31,21],[31,22,31,23],[35,2,35,7],[35,8,35,9],[35,16,35,18],[35,20,35,25],[36,2,36,7],[36,8,36,9],[36,12,36,15],[36,16,36,18],[36,20,36,22],[37,2,37,7],[37,8,37,9],[37,12,37,15],[37,16,37,18],[37,20,37,22],[38,2,38,7],[38,8,38,9],[38,12,38,15],[38,16,38,18],[38,20,38,22],[41,2,41,7],[41,8,41,9],[41,16,41,18],[41,20,41,22],[42,2,42,7],[42,8,42,9],[42,16,42,18],[42,20,42,22],[39,2,39,7],[39,8,39,9],[39,12,39,15],[39,16,39,18],[39,20,39,22],[40,2,40,7],[40,8,40,9],[40,16,40,18],[40,20,40,22],[45,2,45,7],[45,8,45,9],[45,16,45,18],[45,20,45,22],[43,2,43,7],[43,8,43,9],[43,16,43,18],[43,20,43,22],[44,2,44,7],[44,8,44,9],[44,16,44,18],[44,20,44,22]]}
[null,"JBQ Round",3,null,null,null,0,null,30,null,null,null,null,null,null,null,null,null,null,null,null,null,null,null,null,null,null,null,null,null,null,null,null,"Coach Help",null,"10's","20's","30's","Points","Negs","Red",null,"SetC",null,null,null,null,null,null,"Cleared"]
[null,"JBQ Room",null,null,"Stop",null,null,null,null,null,null,null,null,null,null,null,null,null,null,null,null,null,null,null,null,null,null,null,null,null,null,null,null,"Asked",null,{"$f":"COUNTIF($C6:$Y6,10)","v":0},{"$f":"COUNTIF($C6:$Y6,20)","v":0},{"$f":"COUNTIF($C6:$Y6,30)","v":0},{"$f":"(AJ2*10)+(AK2*20)+(AL2*30)","v":0},{"$f":"(AJ2*-5)+(AK2*-10)+(AL2*-15)","v":0},null,null,null,null,null,null,null,null,null,null,"Sounds\\tada.wav"]
[null,"JBQ Division",null,null,null,null,null,null,null,null,null,null,null,null,null,null,null,null,null,null,null,null,null,null,null,null,null,null,null,null,null,null,null,"Max",null,10,7,3,{"$f":"(AJ3*10)+(AK3*20)+(AL3*30)","v":330},{"$f":"(AJ3*-5)+(AK3*-10)+(AL3*-15)","v":-165},0,null,null,null,null,null,null,null,null,"Wave Play"]
[null,"Interrupt",null,null,null,null,null,null,null,null,null,null,null,null,null,null,null,null,null,null,null,null,null,null,null,null,null,null,null,null,null,null,null,"Remaining",null,{"$f":"AJ3-AJ2","v":10},{"$f":"AK3-AK2","v":7},{"$f":"AL3-AL2","v":3},{"$f":"(AJ4*10)+(AK4*20)+(AL4*30)","v":330},{"$f":"(AJ4*-5)+(AK4*-10)+(AL4*-15)","v":-165},0,null,null,null,null,null,null,null,null,"Sounds\\tada.wav"]
[0,"Question Number",1,{"$f":"C5+1","v":2},{"$f":"D5+1","v":3},4,5,6,7,8,9,10,11,12,13,14,15,16,17,18,19,20,"ot1","ot2","ot3",0,null,"Time Start",null,null,"00:07:30",null,null,"Now","00:07:33",null,null,null,null,null,null,null,null,null,null,null,null,null,null,"Wave No File"]
[null,"Point Value ",null,null,null,null,null,null,null,null,null,null,null,null,null,null,null,null,null,null,null,null,null,null,null,null,null,null,null,"Cnt","Cnt",null,null,null,"Cnt","Cnt","Cnt","Cnt","Cnt","Cnt",null,null,null,null,null,null,null,null,null,"C:\\AA\\CedarPark\\JBQ1\\Sounds\\tada.wav"]
[null,"Red Team",null,null,null,null,null,null,"Time-Outs  ",null,null,1,2,3,null,null,"Coach Appeals",null,null,null,1,2,null,null,null,"Fouls","Bonus","Total",null,"Oks","Not","Outs",null,"Rank","10's","20's","30's","-5's","-10's","-15's",null,null,"Neg",null,null,null,null,null,null,"Wave Playing"]
[1,"Quiz-1",null,null,null,null,null,null,null,null,null,null,null,null,null,null,null,null,null,null,null,null,null,null,null,null,{"$f":"IF(AD8>5,10,\"\")","v":""},{"$f":"SUM(C8:AA8)","v":0},null,{"$f":"COUNTIF(C8:Y8,10)+COUNTIF(C8:Y8,20)+COUNTIF(C8:Y8,30)","v":0},{"$f":"COUNTIF(C8:Y8,-5)+COUNTIF(C8:Y8,-10)+COUNTIF(C8:Y8,-15)","v":0},{"$f":"IF(AD8>Data!$J$4,Data!$J$3,IF(AE8>Data!$K$4,Data!$K$3,\" \"))","v":" "},null,{"$f":"RANK(AB8,(AB8:AB15,AB20:AB27),0)","v":1},{"$f":"COUNTIF(C8:Y8,10)","v":0},{"$f":"COUNTIF(C8:Y8,20)","v":0},{"$f":"COUNTIF(C8:Y8,30)","v":0},{"$f":"COUNTIF(C8:Y8,-5)","v":0},{"$f":"COUNTIF(C8:Y8,-10)","v":0},{"$f":"COUNTIF(C8:Y8,-15)","v":0},null,null,"Plus",5,null,null,null,null,null,"Wave Waiting"]
[null,null,null,null,null,null,null,null,null,null,null,null,null,null,null,null,null,null,null,null,null,null,null,null,null,null,{"$f":"IF(AD9>5,10,\"\")","v":""},{"$f":"SUM(C9:AA9)","v":0},null,{"$f":"COUNTIF(C9:Y9,10)+COUNTIF(C9:Y9,20)+COUNTIF(C9:Y9,30)","v":0},{"$f":"COUNTIF(C9:Y9,-5)+COUNTIF(C9:Y9,-10)+COUNTIF(C9:Y9,-15)","v":0},{"$f":"IF(AD9>Data!$J$4,Data!$J$3,IF(AE9>Data!$K$4,Data!$K$3,\" \"))","v":" "},null,{"$f":"RANK(AB9,(AB8:AB15,AB20:AB27),0)","v":1},{"$f":"COUNTIF(C9:Y9,10)","v":0},{"$f":"COUNTIF(C9:Y9,20)","v":0},{"$f":"COUNTIF(C9:Y9,30)","v":0},{"$f":"COUNTIF(C9:Y9,-5)","v":0},{"$f":"COUNTIF(C9:Y9,-10)","v":0},{"$f":"COUNTIF(C9:Y9,-15)","v":0},null,null,"Quiz-Out",4,null,null,null,null,null,"Wave Ending"]
[2,"Quiz-2",null,null,null,null,null,null,null,null,null,null,null,null,null,null,null,null,null,null,null,null,null,null,null,null,"",{"$f":"SUM(C10:AA10)","v":0},null,0,0,{"$f":"IF(AD10>Data!$J$4,Data!$J$3,IF(AE10>Data!$K$4,Data!$K$3,\" \"))","v":" "},null,{"$f":"RANK(AB10,(AB8:AB15,AB20:AB27),0)","v":1},0,0,0,0,0,0,null,null,"Minus",1]
[" ",null,null,null,null,null,null,null,null,null,null,null,null,null,null,null,null,null,null,null,null,null,null,null,null,null,"",{"$f":"SUM(C11:AA11)","v":0},null,0,0,{"$f":"IF(AD11>Data!$J$4,Data!$J$3,IF(AE11>Data!$K$4,Data!$K$3,\" \"))","v":" "},null,{"$f":"RANK(AB11,(AB8:AB15,AB20:AB27),0)","v":1},0,0,0,0,0,0,null,null,"Fizz-Out",2]
[3,"Quiz-3",null,null,null,null,null,null,null,null,null,null,null,null,null,null,null,null,null,null,null,null,null,null,null,null,"",0,null,0,0,{"$f":"IF(AD12>Data!$J$4,Data!$J$3,IF(AE12>Data!$K$4,Data!$K$3,\" \"))","v":" "},null,{"$f":"RANK(AB12,(AB8:AB15,AB20:AB27),0)","v":1},0,0,0,0,0,0,null,null,"Time-Start"]
[" ",null,null,null,null,null,null,null,null,null,null,null,null,null,null,null,null,null,null,null,null,null,null,null,null,null,"",0,null,0,0,{"$f":"IF(AD13>Data!$J$4,Data!$J$3,IF(AE13>Data!$K$4,Data!$K$3,\" \"))","v":" "},null,{"$f":"RANK(AB13,(AB8:AB15,AB20:AB27),0)","v":1},0,0,0,0,0,0,null,null,"Time-Stop"]
[4,"Quiz-4",null,null,null,null,null,null,null,null,null,null,null,null,null,null,null,null,null,null,null,null,null,null,null,null,"",0,null,0,0,{"$f":"IF(AD14>Data!$J$4,Data!$J$3,IF(AE14>Data!$K$4,Data!$K$3,\" \"))","v":" "},null,{"$f":"RANK(AB14,(AB8:AB15,AB20:AB27),0)","v":1},0,0,0,0,0,0,null,null,"Time-End"]
[" ",null,null,null,null,null,null,null,null,null,null,null,null,null,null,null,null,null,null,null,null,null,null,null,null,null,"",0,null,0,0,{"$f":"IF(AD15>Data!$J$4,Data!$J$3,IF(AE15>Data!$K$4,Data!$K$3,\" \"))","v":" "},null,{"$f":"RANK(AB15,(AB8:AB15,AB20:AB27),0)","v":1},0,0,0,0,0,0,null,null,"Sound-On",null,null,null,null,null,null,"21:32:40"]
[" ","Team Fouls",null,null,null,null,null,null,null,null,null,null,null,null,null,null,null,null,null,null,null,null,null,null,null,null,null,0,null,null,null,{"$f":"AB17","v":0}]
[null,"Running Total",{"$f":"SUM(C8:C16)","v":0},{"$f":"C17+SUM(D8:D16)","v":0},0,0,0,0,0,0,0,0,0,{"$f":"M17+SUM(N8:N16)","v":0},0,0,0,0,0,0,0,0,{"$f":"V17+SUM(W8:W16)","v":0},{"$f":"W17+SUM(X8:X16)","v":0},{"$f":"X17+SUM(Y8:Y16)","v":0},{"$f":"X17+SUM(Z8:Z16)","v":0},{"$f":"Z17+SUM(AA8:AA16)","v":0},{"$f":"SUM(AB8:AB16)","v":0},null,{"$f":"SUM(AD8:AD16)","v":0},{"$f":"SUM(AE8:AE16)","v":0},null,null,null,{"$f":"SUM(AI8:AI15)","v":0},0,0,0,0,0]
[]
[null,"Green Team",null,null,null,null,null,null,"Time-Outs  ",null,null,1,2,3,null,null,"Coach Appeals",null,null,null,1,2,null,null,null,"Fouls","Bonus","Total",null,"Oks","Not","Outs"]
[1,"Quizzer-5",null,null,null,null,null,null,null,null,null,null,null,null,null,null,null,null,null,null,null,null,null,null,null,null,{"$f":"IF(AD20>5,10,\"\")","v":""},{"$f":"SUM(C20:AA20)","v":0},null,{"$f":"COUNTIF(C20:Y20,10)+COUNTIF(C20:Y20,20)+COUNTIF(C20:Y20,30)","v":0},{"$f":"COUNTIF(C20:Y20,-5)+COUNTIF(C20:Y20,-10)+COUNTIF(C20:Y20,-15)","v":0},{"$f":"IF(AD20>Data!$J$4,Data!$J$3,IF(AE20>Data!$K$4,Data!$K$3,\" \"))","v":" "},null,{"$f":"RANK(AB20,(AB8:AB15,AB20:AB27),0)","v":1},{"$f":"COUNTIF(C20:Y20,10)","v":0},{"$f":"COUNTIF(C20:Y20,20)","v":0},0,0,0,{"$f":"COUNTIF(C20:Y20,-15)","v":0}]
[null,null,null,null,null,null,null,null,null,null,null,null,null,null,null,null,null,null,null,null,null,null,null,null,null,null,{"$f":"IF(AD21>5,10,\"\")","v":""},0,null,0,0,{"$f":"IF(AD21>Data!$J$4,Data!$J$3,IF(AE21>Data!$K$4,Data!$K$3,\" \"))","v":" "},null,{"$f":"RANK(AB21,(AB8:AB15,AB20:AB27),0)","v":1},0,0,{"$f":"COUNTIF(C21:Y21,30)","v":0},0,0,0]
[2,"Quizzer-6",null,null,null,null,null,null,null,null,null,null,null,null,null,null,null,null,null,null,null,null,null,null,null,null,"",0,null,0,0,{"$f":"IF(AD22>Data!$J$4,Data!$J$3,IF(AE22>Data!$K$4,Data!$K$3,\" \"))","v":" "},null,{"$f":"RANK(AB22,(AB8:AB15,AB20:AB27),0)","v":1},0,0,0,{"$f":"COUNTIF(C22:Y22,-5)","v":0},{"$f":"COUNTIF(C22:Y22,-10)","v":0},0]
[" ",null,null,null,null,null,null,null,null,null,null,null,null,null,null,null,null,null,null,null,null,null,null,null,null,null,"",0,null,0,0,{"$f":"IF(AD23>Data!$J$4,Data!$J$3,IF(AE23>Data!$K$4,Data!$K$3,\" \"))","v":" "},null,{"$f":"RANK(AB23,(AB8:AB15,AB20:AB27),0)","v":1},0,0,0,0,0,0]
[3,"Quizzer-7",null,null,null,null,null,null,null,null,null,null,null,null,null,null,null,null,null,null,null,null,null,null,null,null,"",0,null,0,0,{"$f":"IF(AD24>Data!$J$4,Data!$J$3,IF(AE24>Data!$K$4,Data!$K$3,\" \"))","v":" "},null,{"$f":"RANK(AB24,(AB8:AB15,AB20:AB27),0)","v":1},0,0,0,0,0,0]
[" ",null,null,null,null,null,null,null,null,null,null,null,null,null,null,null,null,null,null,null,null,null,null,null,null,null,"",0,null,0,0,{"$f":"IF(AD25>Data!$J$4,Data!$J$3,IF(AE25>Data!$K$4,Data!$K$3,\" \"))","v":" "},null,{"$f":"RANK(AB25,(AB8:AB15,AB20:AB27),0)","v":1},0,0,0,0,0,0]
[4,"Quizzer-8",null,null,null,null,null,null,null,null,null,null,null,null,null,null,null,null,null,null,null,null,null,null,null,null,"",0,null,0,0,{"$f":"IF(AD26>Data!$J$4,Data!$J$3,IF(AE26>Data!$K$4,Data!$K$3,\" \"))","v":" "},null,{"$f":"RANK(AB26,(AB8:AB15,AB20:AB27),0)","v":1},0,0,0,0,0,0]
[null,null,null,null,null,null,null,null,null,null,null,null,null,null,null,null,null,null,null,null,null,null,null,null,null,null,"",{"$f":"SUM(C27:AA27)","v":0},null,0,0,{"$f":"IF(AD27>Data!$J$4,Data!$J$3,IF(AE27>Data!$K$4,Data!$K$3,\" \"))","v":" "},null,{"$f":"RANK(AB27,(AB8:AB15,AB20:AB27),0)","v":1},0,0,0,0,0,0]
[" ","Team Fouls",null,null,null,null,null,null,null,null,null,null,null,null,null,null,null,null,null,null,null,null,null,null,null,null,null,0,null,"f",null,{"$f":"AB29","v":0}]
[null,"Running Total",{"$f":"SUM(C20:C28)","v":0},{"$f":"C29+SUM(D20:D28)","v":0},0,0,0,0,0,0,0,0,0,0,0,0,0,0,0,0,0,0,0,0,0,0,0,{"$f":"SUM(AB20:AB28)","v":0},null,{"$f":"SUM(AD20:AD28)","v":0},{"$f":"SUM(AE20:AE28)","v":0},null,null,null,{"$f":"SUM(AI20:AI27)","v":0},0,0,0,0,0]
[]
[null," ","   No Scores",null,null,null,null,null,null,null,null,null,"1st Place Team : ",null,null,null,{"$f":"IF(AD17>=AD29,B7,B19)","v":"Red Team"},null,null,null,null,null,"Score : ",null,{"$f":"MAXA(AB17,AB29)","v":0},"Score Difference:",null,null,null,null,null,{"$f":"IF(AB17>AB29,AB17-AB29,AB29-AB17)","v":0},null," ",null,null,null,null,"Not Clear"]
[null,null,null,null,null,null,null,null,null,null,null,null,"2nd Place Team : ",null,null,null,{"$f":"IF(AD17>=AD29,B19,B7)","v":"Green Team"},null,null,null,null,null,"Score : ",null,{"$f":"MINA(AB17,AB29)","v":0}]
[null,null,null,null,null,null,null,null,null,null,null,null,null,null,null,null,null,null,null,null,null,"Difference : ",null,null,{"$f":"Y31-Y32","v":0}]
[]
[]
[]
[null,null,null,null,null,null,null,null,null,null,null,null,"Timer Start",null,null,null,"00:07:30",null,null,null,"Foul Time",null,null,"Foul#","Q#","Foul",null,"User"]
[null,null,null,null,null,null,null,null,null,null,null,null,"Timer Now"]
[null,null,null,null,null,null,null,null,null,null,null,null,"Timer End  ",null,null,null," "]
[null,null,null,null,null,null,null,null,null,null,null,null,"Timer Stop ",null,null,null,"00:07:32"]
[null,null,null,null,null,null,null,null,null,null,null,null,null,null,null,null,"21:32:42"]

{"sheet":"R_4","index":3,"n_rows":41,"n_cols":51,"rows_kept":41,"cut":false,"hidden":false,"merged":[[1,4,1,5],[1,33,1,34],[2,33,2,34],[3,33,3,34],[4,25,5,26],[4,27,4,29],[4,30,4,32],[4,34,4,36],[6,8,6,10],[6,14,6,15],[6,16,6,19],[6,31,6,32],[0,6,1,7],[0,33,0,34],[18,8,18,10],[18,14,18,15],[18,16,18,19],[18,31,18,32],[7,31,7,32],[8,31,8,32],[9,31,9,32],[10,31,10,32],[11,31,11,32],[12,31,12,32],[19,31,19,32],[20,31,20,32],[21,31,21,32],[22,31,22,32],[23,31,23,32],[24,31,24,32],[13,31,13,32],[14,31,14,32],[15,31,16,32],[25,31,25,32],[26,31,26,32],[27,31,28,32],[30,2,30,7],[30,8,30,9],[30,12,30,15],[30,16,30,21],[30,22,30,23],[30,25,31,30],[30,31,31,32],[32,2,32,7],[32,8,32,9],[32,21,32,23],[33,2,33,7],[33,8,33,9],[34,2,34,7],[34,8,34,9],[30,38,30,40],[31,2,31,7],[31,8,31,9],[31,12,31,15],[31,16,31,21],[31,22,31,23],[35,2,35,7],[35,8,35,9],[35,16,35,18],[35,20,35,25],[36,2,36,7],[36,8,36,9],[36,12,36,15],[36,16,36,18],[36,20,36,22],[37,2,37,7],[37,8,37,9],[37,12,37,15],[37,16,37,18],[37,20,37,22],[38,2,38,7],[38,8,38,9],[38,12,38,15],[38,16,38,18],[38,20,38,22],[41,2,41,7],[41,8,41,9],[41,16,41,18],[41,20,41,22],[42,2,42,7],[42,8,42,9],[42,16,42,18],[42,20,42,22],[39,2,39,7],[39,8,39,9],[39,12,39,15],[39,16,39,18],[39,20,39,22],[40,2,40,7],[40,8,40,9],[40,16,40,18],[40,20,40,22],[45,2,45,7],[45,8,45,9],[45,16,45,18],[45,20,45,22],[43,2,43,7],[43,8,43,9],[43,16,43,18],[43,20,43,22],[44,2,44,7],[44,8,44,9],[44,16,44,18],[44,20,44,22]]}
[null,"JBQ Round",4,null,null,null,0,null,30,null,null,null,null,null,null,null,null,null,null,null,null,null,null,null,null,null,null,null,null,null,null,null,null,"Coach Help",null,"10's","20's","30's","Points","Negs","Red",null,"SetC",null,null,null,null,null,null,"Cleared"]
[null,"JBQ Room",null,null,"Stop",null,null,null,null,null,null,null,null,null,null,null,null,null,null,null,null,null,null,null,null,null,null,null,null,null,null,null,null,"Asked",null,{"$f":"COUNTIF($C6:$Y6,10)","v":0},{"$f":"COUNTIF($C6:$Y6,20)","v":0},{"$f":"COUNTIF($C6:$Y6,30)","v":0},{"$f":"(AJ2*10)+(AK2*20)+(AL2*30)","v":0},{"$f":"(AJ2*-5)+(AK2*-10)+(AL2*-15)","v":0},null,null,null,null,null,null,null,null,null,null,"Sounds\\tada.wav"]
[null,"JBQ Division",null,null,null,null,null,null,null,null,null,null,null,null,null,null,null,null,null,null,null,null,null,null,null,null,null,null,null,null,null,null,null,"Max",null,10,7,3,{"$f":"(AJ3*10)+(AK3*20)+(AL3*30)","v":330},{"$f":"(AJ3*-5)+(AK3*-10)+(AL3*-15)","v":-165},0,null,null,null,null,null,null,null,null,"Wave Play"]
[null,"Interrupt",null,null,null,null,null,null,null,null,null,null,null,null,null,null,null,null,null,null,null,null,null,null,null,null,null,null,null,null,null,null,null,"Remaining",null,{"$f":"AJ3-AJ2","v":10},{"$f":"AK3-AK2","v":7},{"$f":"AL3-AL2","v":3},{"$f":"(AJ4*10)+(AK4*20)+(AL4*30)","v":330},{"$f":"(AJ4*-5)+(AK4*-10)+(AL4*-15)","v":-165},0,null,null,null,null,null,null,null,null,"Sounds\\tada.wav"]
[0,"Question Number",1,{"$f":"C5+1","v":2},{"$f":"D5+1","v":3},4,5,6,7,8,9,10,11,12,13,14,15,16,17,18,19,20,"ot1","ot2","ot3",0,null,"Time Start",null,null,"00:07:30",null,null,"Now","00:07:33",null,null,null,null,null,null,null,null,null,null,null,null,null,null,"Wave No File"]
[null,"Point Value ",null,null,null,null,null,null,null,null,null,null,null,null,null,null,null,null,null,null,null,null,null,null,null,null,null,null,null,"Cnt","Cnt",null,null,null,"Cnt","Cnt","Cnt","Cnt","Cnt","Cnt",null,null,null,null,null,null,null,null,null,"C:\\AA\\CedarPark\\JBQ1\\Sounds\\tada.wav"]
[null,"Red Team",null,null,null,null,null,null,"Time-Outs  ",null,null,1,2,3,null,null,"Coach Appeals",null,null,null,1,2,null,null,null,"Fouls","Bonus","Total",null,"Oks","Not","Outs",null,"Rank","10's","20's","30's","-5's","-10's","-15's",null,null,"Neg",null,null,null,null,null,null,"Wave Playing"]
[1,"Quiz-1",null,null,null,null,null,null,null,null,null,null,null,null,null,null,null,null,null,null,null,null,null,null,null,null,{"$f":"IF(AD8>5,10,\"\")","v":""},{"$f":"SUM(C8:AA8)","v":0},null,{"$f":"COUNTIF(C8:Y8,10)+COUNTIF(C8:Y8,20)+COUNTIF(C8:Y8,30)","v":0},{"$f":"COUNTIF(C8:Y8,-5)+COUNTIF(C8:Y8,-10)+COUNTIF(C8:Y8,-15)","v":0},{"$f":"IF(AD8>Data!$J$4,Data!$J$3,IF(AE8>Data!$K$4,Data!$K$3,\" \"))","v":" "},null,{"$f":"RANK(AB8,(AB8:AB15,AB20:AB27),0)","v":1},{"$f":"COUNTIF(C8:Y8,10)","v":0},{"$f":"COUNTIF(C8:Y8,20)","v":0},{"$f":"COUNTIF(C8:Y8,30)","v":0},{"$f":"COUNTIF(C8:Y8,-5)","v":0},{"$f":"COUNTIF(C8:Y8,-10)","v":0},{"$f":"COUNTIF(C8:Y8,-15)","v":0},null,null,"Plus",5,null,null,null,null,null,"Wave Waiting"]
[null,null,null,null,null,null,null,null,null,null,null,null,null,null,null,null,null,null,null,null,null,null,null,null,null,null,{"$f":"IF(AD9>5,10,\"\")","v":""},{"$f":"SUM(C9:AA9)","v":0},null,{"$f":"COUNTIF(C9:Y9,10)+COUNTIF(C9:Y9,20)+COUNTIF(C9:Y9,30)","v":0},{"$f":"COUNTIF(C9:Y9,-5)+COUNTIF(C9:Y9,-10)+COUNTIF(C9:Y9,-15)","v":0},{"$f":"IF(AD9>Data!$J$4,Data!$J$3,IF(AE9>Data!$K$4,Data!$K$3,\" \"))","v":" "},null,{"$f":"RANK(AB9,(AB8:AB15,AB20:AB27),0)","v":1},{"$f":"COUNTIF(C9:Y9,10)","v":0},{"$f":"COUNTIF(C9:Y9,20)","v":0},{"$f":"COUNTIF(C9:Y9,30)","v":0},{"$f":"COUNTIF(C9:Y9,-5)","v":0},{"$f":"COUNTIF(C9:Y9,-10)","v":0},{"$f":"COUNTIF(C9:Y9,-15)","v":0},null,null,"Quiz-Out",4,null,null,null,null,null,"Wave Ending"]
[2,"Quiz-2",null,null,null,null,null,null,null,null,null,null,null,null,null,null,null,null,null,null,null,null,null,null,null,null,"",{"$f":"SUM(C10:AA10)","v":0},null,0,0,{"$f":"IF(AD10>Data!$J$4,Data!$J$3,IF(AE10>Data!$K$4,Data!$K$3,\" \"))","v":" "},null,{"$f":"RANK(AB10,(AB8:AB15,AB20:AB27),0)","v":1},0,0,0,0,0,0,null,null,"Minus",1]
[" ",null,null,null,null,null,null,null,null,null,null,null,null,null,null,null,null,null,null,null,null,null,null,null,null,null,"",{"$f":"SUM(C11:AA11)","v":0},null,0,0,{"$f":"IF(AD11>Data!$J$4,Data!$J$3,IF(AE11>Data!$K$4,Data!$K$3,\" \"))","v":" "},null,{"$f":"RANK(AB11,(AB8:AB15,AB20:AB27),0)","v":1},0,0,0,0,0,0,null,null,"Fizz-Out",2]
[3,"Quiz-3",null,null,null,null,null,null,null,null,null,null,null,null,null,null,null,null,null,null,null,null,null,null,null,null,"",0,null,0,0,{"$f":"IF(AD12>Data!$J$4,Data!$J$3,IF(AE12>Data!$K$4,Data!$K$3,\" \"))","v":" "},null,{"$f":"RANK(AB12,(AB8:AB15,AB20:AB27),0)","v":1},0,0,0,0,0,0,null,null,"Time-Start"]
[" ",null,null,null,null,null,null,null,null,null,null,null,null,null,null,null,null,null,null,null,null,null,null,null,null,null,"",0,null,0,0,{"$f":"IF(AD13>Data!$J$4,Data!$J$3,IF(AE13>Data!$K$4,Data!$K$3,\" \"))","v":" "},null,{"$f":"RANK(AB13,(AB8:AB15,AB20:AB27),0)","v":1},0,0,0,0,0,0,null,null,"Time-Stop"]
[4,"Quiz-4",null,null,null,null,null,null,null,null,null,null,null,null,null,null,null,null,null,null,null,null,null,null,null,null,"",0,null,0,0,{"$f":"IF(AD14>Data!$J$4,Data!$J$3,IF(AE14>Data!$K$4,Data!$K$3,\" \"))","v":" "},null,{"$f":"RANK(AB14,(AB8:AB15,AB20:AB27),0)","v":1},0,0,0,0,0,0,null,null,"Time-End"]
[" ",null,null,null,null,null,null,null,null,null,null,null,null,null,null,null,null,null,null,null,null,null,null,null,null,null,"",0,null,0,0,{"$f":"IF(AD15>Data!$J$4,Data!$J$3,IF(AE15>Data!$K$4,Data!$K$3,\" \"))","v":" "},null,{"$f":"RANK(AB15,(AB8:AB15,AB20:AB27),0)","v":1},0,0,0,0,0,0,null,null,"Sound-On",null,null,null,null,null,null,"21:32:40"]
[" ","Team Fouls",null,null,null,null,null,null,null,null,null,null,null,null,null,null,null,null,null,null,null,null,null,null,null,null,null,0,null,null,null,{"$f":"AB17","v":0}]
[null,"Running Total",{"$f":"SUM(C8:C16)","v":0},{"$f":"C17+SUM(D8:D16)","v":0},0,0,0,0,0,0,0,0,0,{"$f":"M17+SUM(N8:N16)","v":0},0,0,0,0,0,0,0,0,{"$f":"V17+SUM(W8:W16)","v":0},{"$f":"W17+SUM(X8:X16)","v":0},{"$f":"X17+SUM(Y8:Y16)","v":0},{"$f":"X17+SUM(Z8:Z16)","v":0},{"$f":"Z17+SUM(AA8:AA16)","v":0},{"$f":"SUM(AB8:AB16)","v":0},null,{"$f":"SUM(AD8:AD16)","v":0},{"$f":"SUM(AE8:AE16)","v":0},null,null,null,{"$f":"SUM(AI8:AI15)","v":0},0,0,0,0,0]
[]
[null,"Green Team",null,null,null,null,null,null,"Time-Outs  ",null,null,1,2,3,null,null,"Coach Appeals",null,null,null,1,2,null,null,null,"Fouls","Bonus","Total",null,"Oks","Not","Outs"]
[1,"Quizzer-5",null,null,null,null,null,null,null,null,null,null,null,null,null,null,null,null,null,null,null,null,null,null,null,null,{"$f":"IF(AD20>5,10,\"\")","v":""},{"$f":"SUM(C20:AA20)","v":0},null,{"$f":"COUNTIF(C20:Y20,10)+COUNTIF(C20:Y20,20)+COUNTIF(C20:Y20,30)","v":0},{"$f":"COUNTIF(C20:Y20,-5)+COUNTIF(C20:Y20,-10)+COUNTIF(C20:Y20,-15)","v":0},{"$f":"IF(AD20>Data!$J$4,Data!$J$3,IF(AE20>Data!$K$4,Data!$K$3,\" \"))","v":" "},null,{"$f":"RANK(AB20,(AB8:AB15,AB20:AB27),0)","v":1},{"$f":"COUNTIF(C20:Y20,10)","v":0},{"$f":"COUNTIF(C20:Y20,20)","v":0},0,0,0,{"$f":"COUNTIF(C20:Y20,-15)","v":0}]
[null,null,null,null,null,null,null,null,null,null,null,null,null,null,null,null,null,null,null,null,null,null,null,null,null,null,{"$f":"IF(AD21>5,10,\"\")","v":""},0,null,0,0,{"$f":"IF(AD21>Data!$J$4,Data!$J$3,IF(AE21>Data!$K$4,Data!$K$3,\" \"))","v":" "},null,{"$f":"RANK(AB21,(AB8:AB15,AB20:AB27),0)","v":1},0,0,{"$f":"COUNTIF(C21:Y21,30)","v":0},0,0,0]
[2,"Quizzer-6",null,null,null,null,null,null,null,null,null,null,null,null,null,null,null,null,null,null,null,null,null,null,null,null,"",0,null,0,0,{"$f":"IF(AD22>Data!$J$4,Data!$J$3,IF(AE22>Data!$K$4,Data!$K$3,\" \"))","v":" "},null,{"$f":"RANK(AB22,(AB8:AB15,AB20:AB27),0)","v":1},0,0,0,{"$f":"COUNTIF(C22:Y22,-5)","v":0},{"$f":"COUNTIF(C22:Y22,-10)","v":0},0]
[" ",null,null,null,null,null,null,null,null,null,null,null,null,null,null,null,null,null,null,null,null,null,null,null,null,null,"",0,null,0,0,{"$f":"IF(AD23>Data!$J$4,Data!$J$3,IF(AE23>Data!$K$4,Data!$K$3,\" \"))","v":" "},null,{"$f":"RANK(AB23,(AB8:AB15,AB20:AB27),0)","v":1},0,0,0,0,0,0]
[3,"Quizzer-7",null,null,null,null,null,null,null,null,null,null,null,null,null,null,null,null,null,null,null,null,null,null,null,null,"",0,null,0,0,{"$f":"IF(AD24>Data!$J$4,Data!$J$3,IF(AE24>Data!$K$4,Data!$K$3,\" \"))","v":" "},null,{"$f":"RANK(AB24,(AB8:AB15,AB20:AB27),0)","v":1},0,0,0,0,0,0]
[" ",null,null,null,null,null,null,null,null,null,null,null,null,null,null,null,null,null,null,null,null,null,null,null,null,null,"",0,null,0,0,{"$f":"IF(AD25>Data!$J$4,Data!$J$3,IF(AE25>Data!$K$4,Data!$K$3,\" \"))","v":" "},null,{"$f":"RANK(AB25,(AB8:AB15,AB20:AB27),0)","v":1},0,0,0,0,0,0]
[4,"Quizzer-8",null,null,null,null,null,null,null,null,null,null,null,null,null,null,null,null,null,null,null,null,null,null,null,null,"",0,null,0,0,{"$f":"IF(AD26>Data!$J$4,Data!$J$3,IF(AE26>Data!$K$4,Data!$K$3,\" \"))","v":" "},null,{"$f":"RANK(AB26,(AB8:AB15,AB20:AB27),0)","v":1},0,0,0,0,0,0]
[null,null,null,null,null,null,null,null,null,null,null,null,null,null,null,null,null,null,null,null,null,null,null,null,null,null,"",{"$f":"SUM(C27:AA27)","v":0},null,0,0,{"$f":"IF(AD27>Data!$J$4,Data!$J$3,IF(AE27>Data!$K$4,Data!$K$3,\" \"))","v":" "},null,{"$f":"RANK(AB27,(AB8:AB15,AB20:AB27),0)","v":1},0,0,0,0,0,0]
[" ","Team Fouls",null,null,null,null,null,null,null,null,null,null,null,null,null,null,null,null,null,null,null,null,null,null,null,null,null,0,null,"f",null,{"$f":"AB29","v":0}]
[null,"Running Total",{"$f":"SUM(C20:C28)","v":0},{"$f":"C29+SUM(D20:D28)","v":0},0,0,0,0,0,0,0,0,0,0,0,0,0,0,0,0,0,0,0,0,0,0,0,{"$f":"SUM(AB20:AB28)","v":0},null,{"$f":"SUM(AD20:AD28)","v":0},{"$f":"SUM(AE20:AE28)","v":0},null,null,null,{"$f":"SUM(AI20:AI27)","v":0},0,0,0,0,0]
[]
[null," ","   No Scores",null,null,null,null,null,null,null,null,null,"1st Place Team : ",null,null,null,{"$f":"IF(AD17>=AD29,B7,B19)","v":"Red Team"},null,null,null,null,null,"Score : ",null,{"$f":"MAXA(AB17,AB29)","v":0},"Score Difference:",null,null,null,null,null,{"$f":"IF(AB17>AB29,AB17-AB29,AB29-AB17)","v":0},null," ",null,null,null,null,"Not Clear"]
[null,null,null,null,null,null,null,null,null,null,null,null,"2nd Place Team : ",null,null,null,{"$f":"IF(AD17>=AD29,B19,B7)","v":"Green Team"},null,null,null,null,null,"Score : ",null,{"$f":"MINA(AB17,AB29)","v":0}]
[null,null,null,null,null,null,null,null,null,null,null,null,null,null,null,null,null,null,null,null,null,"Difference : ",null,null,{"$f":"Y31-Y32","v":0}]
[]
[]
[]
[null,null,null,null,null,null,null,null,null,null,null,null,"Timer Start",null,null,null,"00:07:30",null,null,null,"Foul Time",null,null,"Foul#","Q#","Foul",null,"User"]
[null,null,null,null,null,null,null,null,null,null,null,null,"Timer Now"]
[null,null,null,null,null,null,null,null,null,null,null,null,"Timer End  ",null,null,null," "]
[null,null,null,null,null,null,null,null,null,null,null,null,"Timer Stop ",null,null,null,"00:07:32"]
[null,null,null,null,null,null,null,null,null,null,null,null,null,null,null,null,"21:32:42"]

{"sheet":"R_5","index":4,"n_rows":41,"n_cols":51,"rows_kept":41,"cut":false,"hidden":false,"merged":[[1,4,1,5],[1,33,1,34],[2,33,2,34],[3,33,3,34],[4,25,5,26],[4,27,4,29],[4,30,4,32],[4,34,4,36],[6,8,6,10],[6,14,6,15],[6,16,6,19],[6,31,6,32],[0,6,1,7],[0,33,0,34],[18,8,18,10],[18,14,18,15],[18,16,18,19],[18,31,18,32],[7,31,7,32],[8,31,8,32],[9,31,9,32],[10,31,10,32],[11,31,11,32],[12,31,12,32],[19,31,19,32],[20,31,20,32],[21,31,21,32],[22,31,22,32],[23,31,23,32],[24,31,24,32],[13,31,13,32],[14,31,14,32],[15,31,16,32],[25,31,25,32],[26,31,26,32],[27,31,28,32],[30,2,30,7],[30,8,30,9],[30,12,30,15],[30,16,30,21],[30,22,30,23],[30,25,31,30],[30,31,31,32],[32,2,32,7],[32,8,32,9],[32,21,32,23],[33,2,33,7],[33,8,33,9],[34,2,34,7],[34,8,34,9],[30,38,30,40],[31,2,31,7],[31,8,31,9],[31,12,31,15],[31,16,31,21],[31,22,31,23],[35,2,35,7],[35,8,35,9],[35,16,35,18],[35,20,35,25],[36,2,36,7],[36,8,36,9],[36,12,36,15],[36,16,36,18],[36,20,36,22],[37,2,37,7],[37,8,37,9],[37,12,37,15],[37,16,37,18],[37,20,37,22],[38,2,38,7],[38,8,38,9],[38,12,38,15],[38,16,38,18],[38,20,38,22],[41,2,41,7],[41,8,41,9],[41,16,41,18],[41,20,41,22],[42,2,42,7],[42,8,42,9],[42,16,42,18],[42,20,42,22],[39,2,39,7],[39,8,39,9],[39,12,39,15],[39,16,39,18],[39,20,39,22],[40,2,40,7],[40,8,40,9],[40,16,40,18],[40,20,40,22],[45,2,45,7],[45,8,45,9],[45,16,45,18],[45,20,45,22],[43,2,43,7],[43,8,43,9],[43,16,43,18],[43,20,43,22],[44,2,44,7],[44,8,44,9],[44,16,44,18],[44,20,44,22]]}
[null,"JBQ Round",5,null,null,null,0,null,30,null,null,null,null,null,null,null,null,null,null,null,null,null,null,null,null,null,null,null,null,null,null,null,null,"Coach Help",null,"10's","20's","30's","Points","Negs","Red",null,"SetC",null,null,null,null,null,null,"Cleared"]
[null,"JBQ Room",null,null,"Stop",null,null,null,null,null,null,null,null,null,null,null,null,null,null,null,null,null,null,null,null,null,null,null,null,null,null,null,null,"Asked",null,{"$f":"COUNTIF($C6:$Y6,10)","v":0},{"$f":"COUNTIF($C6:$Y6,20)","v":0},{"$f":"COUNTIF($C6:$Y6,30)","v":0},{"$f":"(AJ2*10)+(AK2*20)+(AL2*30)","v":0},{"$f":"(AJ2*-5)+(AK2*-10)+(AL2*-15)","v":0},null,null,null,null,null,null,null,null,null,null,"Sounds\\tada.wav"]
[null,"JBQ Division",null,null,null,null,null,null,null,null,null,null,null,null,null,null,null,null,null,null,null,null,null,null,null,null,null,null,null,null,null,null,null,"Max",null,10,7,3,{"$f":"(AJ3*10)+(AK3*20)+(AL3*30)","v":330},{"$f":"(AJ3*-5)+(AK3*-10)+(AL3*-15)","v":-165},0,null,null,null,null,null,null,null,null,"Wave Play"]
[null,"Interrupt",null,null,null,null,null,null,null,null,null,null,null,null,null,null,null,null,null,null,null,null,null,null,null,null,null,null,null,null,null,null,null,"Remaining",null,{"$f":"AJ3-AJ2","v":10},{"$f":"AK3-AK2","v":7},{"$f":"AL3-AL2","v":3},{"$f":"(AJ4*10)+(AK4*20)+(AL4*30)","v":330},{"$f":"(AJ4*-5)+(AK4*-10)+(AL4*-15)","v":-165},0,null,null,null,null,null,null,null,null,"Sounds\\tada.wav"]
[0,"Question Number",1,{"$f":"C5+1","v":2},{"$f":"D5+1","v":3},4,5,6,7,8,9,10,11,12,13,14,15,16,17,18,19,20,"ot1","ot2","ot3",0,null,"Time Start",null,null,"00:07:30",null,null,"Now","00:07:33",null,null,null,null,null,null,null,null,null,null,null,null,null,null,"Wave No File"]
[null,"Point Value ",null,null,null,null,null,null,null,null,null,null,null,null,null,null,null,null,null,null,null,null,null,null,null,null,null,null,null,"Cnt","Cnt",null,null,null,"Cnt","Cnt","Cnt","Cnt","Cnt","Cnt",null,null,null,null,null,null,null,null,null,"C:\\AA\\CedarPark\\JBQ1\\Sounds\\tada.wav"]
[null,"Red Team",null,null,null,null,null,null,"Time-Outs  ",null,null,1,2,3,null,null,"Coach Appeals",null,null,null,1,2,null,null,null,"Fouls","Bonus","Total",null,"Oks","Not","Outs",null,"Rank","10's","20's","30's","-5's","-10's","-15's",null,null,"Neg",null,null,null,null,null,null,"Wave Playing"]
[1,"Quiz-1",null,null,null,null,null,null,null,null,null,null,null,null,null,null,null,null,null,null,null,null,null,null,null,null,{"$f":"IF(AD8>5,10,\"\")","v":""},{"$f":"SUM(C8:AA8)","v":0},null,{"$f":"COUNTIF(C8:Y8,10)+COUNTIF(C8:Y8,20)+COUNTIF(C8:Y8,30)","v":0},{"$f":"COUNTIF(C8:Y8,-5)+COUNTIF(C8:Y8,-10)+COUNTIF(C8:Y8,-15)","v":0},{"$f":"IF(AD8>Data!$J$4,Data!$J$3,IF(AE8>Data!$K$4,Data!$K$3,\" \"))","v":" "},null,{"$f":"RANK(AB8,(AB8:AB15,AB20:AB27),0)","v":1},{"$f":"COUNTIF(C8:Y8,10)","v":0},{"$f":"COUNTIF(C8:Y8,20)","v":0},{"$f":"COUNTIF(C8:Y8,30)","v":0},{"$f":"COUNTIF(C8:Y8,-5)","v":0},{"$f":"COUNTIF(C8:Y8,-10)","v":0},{"$f":"COUNTIF(C8:Y8,-15)","v":0},null,null,"Plus",5,null,null,null,null,null,"Wave Waiting"]
[null,null,null,null,null,null,null,null,null,null,null,null,null,null,null,null,null,null,null,null,null,null,null,null,null,null,{"$f":"IF(AD9>5,10,\"\")","v":""},{"$f":"SUM(C9:AA9)","v":0},null,{"$f":"COUNTIF(C9:Y9,10)+COUNTIF(C9:Y9,20)+COUNTIF(C9:Y9,30)","v":0},{"$f":"COUNTIF(C9:Y9,-5)+COUNTIF(C9:Y9,-10)+COUNTIF(C9:Y9,-15)","v":0},{"$f":"IF(AD9>Data!$J$4,Data!$J$3,IF(AE9>Data!$K$4,Data!$K$3,\" \"))","v":" "},null,{"$f":"RANK(AB9,(AB8:AB15,AB20:AB27),0)","v":1},{"$f":"COUNTIF(C9:Y9,10)","v":0},{"$f":"COUNTIF(C9:Y9,20)","v":0},{"$f":"COUNTIF(C9:Y9,30)","v":0},{"$f":"COUNTIF(C9:Y9,-5)","v":0},{"$f":"COUNTIF(C9:Y9,-10)","v":0},{"$f":"COUNTIF(C9:Y9,-15)","v":0},null,null,"Quiz-Out",4,null,null,null,null,null,"Wave Ending"]
[2,"Quiz-2",null,null,null,null,null,null,null,null,null,null,null,null,null,null,null,null,null,null,null,null,null,null,null,null,"",{"$f":"SUM(C10:AA10)","v":0},null,0,0,{"$f":"IF(AD10>Data!$J$4,Data!$J$3,IF(AE10>Data!$K$4,Data!$K$3,\" \"))","v":" "},null,{"$f":"RANK(AB10,(AB8:AB15,AB20:AB27),0)","v":1},0,0,0,0,0,0,null,null,"Minus",1]
[" ",null,null,null,null,null,null,null,null,null,null,null,null,null,null,null,null,null,null,null,null,null,null,null,null,null,"",{"$f":"SUM(C11:AA11)","v":0},null,0,0,{"$f":"IF(AD11>Data!$J$4,Data!$J$3,IF(AE11>Data!$K$4,Data!$K$3,\" \"))","v":" "},null,{"$f":"RANK(AB11,(AB8:AB15,AB20:AB27),0)","v":1},0,0,0,0,0,0,null,null,"Fizz-Out",2]
[3,"Quiz-3",null,null,null,null,null,null,null,null,null,null,null,null,null,null,null,null,null,null,null,null,null,null,null,null,"",0,null,0,0,{"$f":"IF(AD12>Data!$J$4,Data!$J$3,IF(AE12>Data!$K$4,Data!$K$3,\" \"))","v":" "},null,{"$f":"RANK(AB12,(AB8:AB15,AB20:AB27),0)","v":1},0,0,0,0,0,0,null,null,"Time-Start"]
[" ",null,null,null,null,null,null,null,null,null,null,null,null,null,null,null,null,null,null,null,null,null,null,null,null,null,"",0,null,0,0,{"$f":"IF(AD13>Data!$J$4,Data!$J$3,IF(AE13>Data!$K$4,Data!$K$3,\" \"))","v":" "},null,{"$f":"RANK(AB13,(AB8:AB15,AB20:AB27),0)","v":1},0,0,0,0,0,0,null,null,"Time-Stop"]
[4,"Quiz-4",null,null,null,null,null,null,null,null,null,null,null,null,null,null,null,null,null,null,null,null,null,null,null,null,"",0,null,0,0,{"$f":"IF(AD14>Data!$J$4,Data!$J$3,IF(AE14>Data!$K$4,Data!$K$3,\" \"))","v":" "},null,{"$f":"RANK(AB14,(AB8:AB15,AB20:AB27),0)","v":1},0,0,0,0,0,0,null,null,"Time-End"]
[" ",null,null,null,null,null,null,null,null,null,null,null,null,null,null,null,null,null,null,null,null,null,null,null,null,null,"",0,null,0,0,{"$f":"IF(AD15>Data!$J$4,Data!$J$3,IF(AE15>Data!$K$4,Data!$K$3,\" \"))","v":" "},null,{"$f":"RANK(AB15,(AB8:AB15,AB20:AB27),0)","v":1},0,0,0,0,0,0,null,null,"Sound-On",null,null,null,null,null,null,"21:32:40"]
[" ","Team Fouls",null,null,null,null,null,null,null,null,null,null,null,null,null,null,null,null,null,null,null,null,null,null,null,null,null,0,null,null,null,{"$f":"AB17","v":0}]
[null,"Running Total",{"$f":"SUM(C8:C16)","v":0},{"$f":"C17+SUM(D8:D16)","v":0},0,0,0,0,0,0,0,0,0,{"$f":"M17+SUM(N8:N16)","v":0},0,0,0,0,0,0,0,0,{"$f":"V17+SUM(W8:W16)","v":0},{"$f":"W17+SUM(X8:X16)","v":0},{"$f":"X17+SUM(Y8:Y16)","v":0},{"$f":"X17+SUM(Z8:Z16)","v":0},{"$f":"Z17+SUM(AA8:AA16)","v":0},{"$f":"SUM(AB8:AB16)","v":0},null,{"$f":"SUM(AD8:AD16)","v":0},{"$f":"SUM(AE8:AE16)","v":0},null,null,null,{"$f":"SUM(AI8:AI15)","v":0},0,0,0,0,0]
[]
[null,"Green Team",null,null,null,null,null,null,"Time-Outs  ",null,null,1,2,3,null,null,"Coach Appeals",null,null,null,1,2,null,null,null,"Fouls","Bonus","Total",null,"Oks","Not","Outs"]
[1,"Quizzer-5",null,null,null,null,null,null,null,null,null,null,null,null,null,null,null,null,null,null,null,null,null,null,null,null,{"$f":"IF(AD20>5,10,\"\")","v":""},{"$f":"SUM(C20:AA20)","v":0},null,{"$f":"COUNTIF(C20:Y20,10)+COUNTIF(C20:Y20,20)+COUNTIF(C20:Y20,30)","v":0},{"$f":"COUNTIF(C20:Y20,-5)+COUNTIF(C20:Y20,-10)+COUNTIF(C20:Y20,-15)","v":0},{"$f":"IF(AD20>Data!$J$4,Data!$J$3,IF(AE20>Data!$K$4,Data!$K$3,\" \"))","v":" "},null,{"$f":"RANK(AB20,(AB8:AB15,AB20:AB27),0)","v":1},{"$f":"COUNTIF(C20:Y20,10)","v":0},{"$f":"COUNTIF(C20:Y20,20)","v":0},0,0,0,{"$f":"COUNTIF(C20:Y20,-15)","v":0}]
[null,null,null,null,null,null,null,null,null,null,null,null,null,null,null,null,null,null,null,null,null,null,null,null,null,null,{"$f":"IF(AD21>5,10,\"\")","v":""},0,null,0,0,{"$f":"IF(AD21>Data!$J$4,Data!$J$3,IF(AE21>Data!$K$4,Data!$K$3,\" \"))","v":" "},null,{"$f":"RANK(AB21,(AB8:AB15,AB20:AB27),0)","v":1},0,0,{"$f":"COUNTIF(C21:Y21,30)","v":0},0,0,0]
[2,"Quizzer-6",null,null,null,null,null,null,null,null,null,null,null,null,null,null,null,null,null,null,null,null,null,null,null,null,"",0,null,0,0,{"$f":"IF(AD22>Data!$J$4,Data!$J$3,IF(AE22>Data!$K$4,Data!$K$3,\" \"))","v":" "},null,{"$f":"RANK(AB22,(AB8:AB15,AB20:AB27),0)","v":1},0,0,0,{"$f":"COUNTIF(C22:Y22,-5)","v":0},{"$f":"COUNTIF(C22:Y22,-10)","v":0},0]
[" ",null,null,null,null,null,null,null,null,null,null,null,null,null,null,null,null,null,null,null,null,null,null,null,null,null,"",0,null,0,0,{"$f":"IF(AD23>Data!$J$4,Data!$J$3,IF(AE23>Data!$K$4,Data!$K$3,\" \"))","v":" "},null,{"$f":"RANK(AB23,(AB8:AB15,AB20:AB27),0)","v":1},0,0,0,0,0,0]
[3,"Quizzer-7",null,null,null,null,null,null,null,null,null,null,null,null,null,null,null,null,null,null,null,null,null,null,null,null,"",0,null,0,0,{"$f":"IF(AD24>Data!$J$4,Data!$J$3,IF(AE24>Data!$K$4,Data!$K$3,\" \"))","v":" "},null,{"$f":"RANK(AB24,(AB8:AB15,AB20:AB27),0)","v":1},0,0,0,0,0,0]
[" ",null,null,null,null,null,null,null,null,null,null,null,null,null,null,null,null,null,null,null,null,null,null,null,null,null,"",0,null,0,0,{"$f":"IF(AD25>Data!$J$4,Data!$J$3,IF(AE25>Data!$K$4,Data!$K$3,\" \"))","v":" "},null,{"$f":"RANK(AB25,(AB8:AB15,AB20:AB27),0)","v":1},0,0,0,0,0,0]
[4,"Quizzer-8",null,null,null,null,null,null,null,null,null,null,null,null,null,null,null,null,null,null,null,null,null,null,null,null,"",0,null,0,0,{"$f":"IF(AD26>Data!$J$4,Data!$J$3,IF(AE26>Data!$K$4,Data!$K$3,\" \"))","v":" "},null,{"$f":"RANK(AB26,(AB8:AB15,AB20:AB27),0)","v":1},0,0,0,0,0,0]
[null,null,null,null,null,null,null,null,null,null,null,null,null,null,null,null,null,null,null,null,null,null,null,null,null,null,"",{"$f":"SUM(C27:AA27)","v":0},null,0,0,{"$f":"IF(AD27>Data!$J$4,Data!$J$3,IF(AE27>Data!$K$4,Data!$K$3,\" \"))","v":" "},null,{"$f":"RANK(AB27,(AB8:AB15,AB20:AB27),0)","v":1},0,0,0,0,0,0]
[" ","Team Fouls",null,null,null,null,null,null,null,null,null,null,null,null,null,null,null,null,null,null,null,null,null,null,null,null,null,0,null,"f",null,{"$f":"AB29","v":0}]
[null,"Running Total",{"$f":"SUM(C20:C28)","v":0},{"$f":"C29+SUM(D20:D28)","v":0},0,0,0,0,0,0,0,0,0,0,0,0,0,0,0,0,0,0,0,0,0,0,0,{"$f":"SUM(AB20:AB28)","v":0},null,{"$f":"SUM(AD20:AD28)","v":0},{"$f":"SUM(AE20:AE28)","v":0},null,null,null,{"$f":"SUM(AI20:AI27)","v":0},0,0,0,0,0]
[]
[null," ","   No Scores",null,null,null,null,null,null,null,null,null,"1st Place Team : ",null,null,null,{"$f":"IF(AD17>=AD29,B7,B19)","v":"Red Team"},null,null,null,null,null,"Score : ",null,{"$f":"MAXA(AB17,AB29)","v":0},"Score Difference:",null,null,null,null,null,{"$f":"IF(AB17>AB29,AB17-AB29,AB29-AB17)","v":0},null," ",null,null,null,null,"Not Clear"]
[null,null,null,null,null,null,null,null,null,null,null,null,"2nd Place Team : ",null,null,null,{"$f":"IF(AD17>=AD29,B19,B7)","v":"Green Team"},null,null,null,null,null,"Score : ",null,{"$f":"MINA(AB17,AB29)","v":0}]
[null,null,null,null,null,null,null,null,null,null,null,null,null,null,null,null,null,null,null,null,null,"Difference : ",null,null,{"$f":"Y31-Y32","v":0}]
[]
[]
[]
[null,null,null,null,null,null,null,null,null,null,null,null,"Timer Start",null,null,null,"00:07:30",null,null,null,"Foul Time",null,null,"Foul#","Q#","Foul",null,"User"]
[null,null,null,null,null,null,null,null,null,null,null,null,"Timer Now"]
[null,null,null,null,null,null,null,null,null,null,null,null,"Timer End  ",null,null,null," "]
[null,null,null,null,null,null,null,null,null,null,null,null,"Timer Stop ",null,null,null,"00:07:32"]
[null,null,null,null,null,null,null,null,null,null,null,null,null,null,null,null,"21:32:42"]

{"sheet":"R_6","index":5,"n_rows":41,"n_cols":51,"rows_kept":41,"cut":false,"hidden":false,"merged":[[1,4,1,5],[1,33,1,34],[2,33,2,34],[3,33,3,34],[4,25,5,26],[4,27,4,29],[4,30,4,32],[4,34,4,36],[6,8,6,10],[6,14,6,15],[6,16,6,19],[6,31,6,32],[0,6,1,7],[0,33,0,34],[18,8,18,10],[18,14,18,15],[18,16,18,19],[18,31,18,32],[7,31,7,32],[8,31,8,32],[9,31,9,32],[10,31,10,32],[11,31,11,32],[12,31,12,32],[19,31,19,32],[20,31,20,32],[21,31,21,32],[22,31,22,32],[23,31,23,32],[24,31,24,32],[13,31,13,32],[14,31,14,32],[15,31,16,32],[25,31,25,32],[26,31,26,32],[27,31,28,32],[30,2,30,7],[30,8,30,9],[30,12,30,15],[30,16,30,21],[30,22,30,23],[30,25,31,30],[30,31,31,32],[32,2,32,7],[32,8,32,9],[32,21,32,23],[33,2,33,7],[33,8,33,9],[34,2,34,7],[34,8,34,9],[30,38,30,40],[31,2,31,7],[31,8,31,9],[31,12,31,15],[31,16,31,21],[31,22,31,23],[35,2,35,7],[35,8,35,9],[35,16,35,18],[35,20,35,25],[36,2,36,7],[36,8,36,9],[36,12,36,15],[36,16,36,18],[36,20,36,22],[37,2,37,7],[37,8,37,9],[37,12,37,15],[37,16,37,18],[37,20,37,22],[38,2,38,7],[38,8,38,9],[38,12,38,15],[38,16,38,18],[38,20,38,22],[41,2,41,7],[41,8,41,9],[41,16,41,18],[41,20,41,22],[42,2,42,7],[42,8,42,9],[42,16,42,18],[42,20,42,22],[39,2,39,7],[39,8,39,9],[39,12,39,15],[39,16,39,18],[39,20,39,22],[40,2,40,7],[40,8,40,9],[40,16,40,18],[40,20,40,22],[45,2,45,7],[45,8,45,9],[45,16,45,18],[45,20,45,22],[43,2,43,7],[43,8,43,9],[43,16,43,18],[43,20,43,22],[44,2,44,7],[44,8,44,9],[44,16,44,18],[44,20,44,22]]}
[null,"JBQ Round",6,null,null,null,0,null,30,null,null,null,null,null,null,null,null,null,null,null,null,null,null,null,null,null,null,null,null,null,null,null,null,"Coach Help",null,"10's","20's","30's","Points","Negs","Red",null,"SetC",null,null,null,null,null,null,"Cleared"]
[null,"JBQ Room",null,null,"Stop",null,null,null,null,null,null,null,null,null,null,null,null,null,null,null,null,null,null,null,null,null,null,null,null,null,null,null,null,"Asked",null,{"$f":"COUNTIF($C6:$Y6,10)","v":0},{"$f":"COUNTIF($C6:$Y6,20)","v":0},{"$f":"COUNTIF($C6:$Y6,30)","v":0},{"$f":"(AJ2*10)+(AK2*20)+(AL2*30)","v":0},{"$f":"(AJ2*-5)+(AK2*-10)+(AL2*-15)","v":0},null,null,null,null,null,null,null,null,null,null,"Sounds\\tada.wav"]
[null,"JBQ Division",null,null,null,null,null,null,null,null,null,null,null,null,null,null,null,null,null,null,null,null,null,null,null,null,null,null,null,null,null,null,null,"Max",null,10,7,3,{"$f":"(AJ3*10)+(AK3*20)+(AL3*30)","v":330},{"$f":"(AJ3*-5)+(AK3*-10)+(AL3*-15)","v":-165},0,null,null,null,null,null,null,null,null,"Wave Play"]
[null,"Interrupt",null,null,null,null,null,null,null,null,null,null,null,null,null,null,null,null,null,null,null,null,null,null,null,null,null,null,null,null,null,null,null,"Remaining",null,{"$f":"AJ3-AJ2","v":10},{"$f":"AK3-AK2","v":7},{"$f":"AL3-AL2","v":3},{"$f":"(AJ4*10)+(AK4*20)+(AL4*30)","v":330},{"$f":"(AJ4*-5)+(AK4*-10)+(AL4*-15)","v":-165},0,null,null,null,null,null,null,null,null,"Sounds\\tada.wav"]
[0,"Question Number",1,{"$f":"C5+1","v":2},{"$f":"D5+1","v":3},4,5,6,7,8,9,10,11,12,13,14,15,16,17,18,19,20,"ot1","ot2","ot3",0,null,"Time Start",null,null,"00:07:30",null,null,"Now","00:07:33",null,null,null,null,null,null,null,null,null,null,null,null,null,null,"Wave No File"]
[null,"Point Value ",null,null,null,null,null,null,null,null,null,null,null,null,null,null,null,null,null,null,null,null,null,null,null,null,null,null,null,"Cnt","Cnt",null,null,null,"Cnt","Cnt","Cnt","Cnt","Cnt","Cnt",null,null,null,null,null,null,null,null,null,"C:\\AA\\CedarPark\\JBQ1\\Sounds\\tada.wav"]
[null,"Red Team",null,null,null,null,null,null,"Time-Outs  ",null,null,1,2,3,null,null,"Coach Appeals",null,null,null,1,2,null,null,null,"Fouls","Bonus","Total",null,"Oks","Not","Outs",null,"Rank","10's","20's","30's","-5's","-10's","-15's",null,null,"Neg",null,null,null,null,null,null,"Wave Playing"]
[1,"Quiz-1",null,null,null,null,null,null,null,null,null,null,null,null,null,null,null,null,null,null,null,null,null,null,null,null,{"$f":"IF(AD8>5,10,\"\")","v":""},{"$f":"SUM(C8:AA8)","v":0},null,{"$f":"COUNTIF(C8:Y8,10)+COUNTIF(C8:Y8,20)+COUNTIF(C8:Y8,30)","v":0},{"$f":"COUNTIF(C8:Y8,-5)+COUNTIF(C8:Y8,-10)+COUNTIF(C8:Y8,-15)","v":0},{"$f":"IF(AD8>Data!$J$4,Data!$J$3,IF(AE8>Data!$K$4,Data!$K$3,\" \"))","v":" "},null,{"$f":"RANK(AB8,(AB8:AB15,AB20:AB27),0)","v":1},{"$f":"COUNTIF(C8:Y8,10)","v":0},{"$f":"COUNTIF(C8:Y8,20)","v":0},{"$f":"COUNTIF(C8:Y8,30)","v":0},{"$f":"COUNTIF(C8:Y8,-5)","v":0},{"$f":"COUNTIF(C8:Y8,-10)","v":0},{"$f":"COUNTIF(C8:Y8,-15)","v":0},null,null,"Plus",5,null,null,null,null,null,"Wave Waiting"]
[null,null,null,null,null,null,null,null,null,null,null,null,null,null,null,null,null,null,null,null,null,null,null,null,null,null,{"$f":"IF(AD9>5,10,\"\")","v":""},{"$f":"SUM(C9:AA9)","v":0},null,{"$f":"COUNTIF(C9:Y9,10)+COUNTIF(C9:Y9,20)+COUNTIF(C9:Y9,30)","v":0},{"$f":"COUNTIF(C9:Y9,-5)+COUNTIF(C9:Y9,-10)+COUNTIF(C9:Y9,-15)","v":0},{"$f":"IF(AD9>Data!$J$4,Data!$J$3,IF(AE9>Data!$K$4,Data!$K$3,\" \"))","v":" "},null,{"$f":"RANK(AB9,(AB8:AB15,AB20:AB27),0)","v":1},{"$f":"COUNTIF(C9:Y9,10)","v":0},{"$f":"COUNTIF(C9:Y9,20)","v":0},{"$f":"COUNTIF(C9:Y9,30)","v":0},{"$f":"COUNTIF(C9:Y9,-5)","v":0},{"$f":"COUNTIF(C9:Y9,-10)","v":0},{"$f":"COUNTIF(C9:Y9,-15)","v":0},null,null,"Quiz-Out",4,null,null,null,null,null,"Wave Ending"]
[2,"Quiz-2",null,null,null,null,null,null,null,null,null,null,null,null,null,null,null,null,null,null,null,null,null,null,null,null,"",{"$f":"SUM(C10:AA10)","v":0},null,0,0,{"$f":"IF(AD10>Data!$J$4,Data!$J$3,IF(AE10>Data!$K$4,Data!$K$3,\" \"))","v":" "},null,{"$f":"RANK(AB10,(AB8:AB15,AB20:AB27),0)","v":1},0,0,0,0,0,0,null,null,"Minus",1]
[" ",null,null,null,null,null,null,null,null,null,null,null,null,null,null,null,null,null,null,null,null,null,null,null,null,null,"",{"$f":"SUM(C11:AA11)","v":0},null,0,0,{"$f":"IF(AD11>Data!$J$4,Data!$J$3,IF(AE11>Data!$K$4,Data!$K$3,\" \"))","v":" "},null,{"$f":"RANK(AB11,(AB8:AB15,AB20:AB27),0)","v":1},0,0,0,0,0,0,null,null,"Fizz-Out",2]
[3,"Quiz-3",null,null,null,null,null,null,null,null,null,null,null,null,null,null,null,null,null,null,null,null,null,null,null,null,"",0,null,0,0,{"$f":"IF(AD12>Data!$J$4,Data!$J$3,IF(AE12>Data!$K$4,Data!$K$3,\" \"))","v":" "},null,{"$f":"RANK(AB12,(AB8:AB15,AB20:AB27),0)","v":1},0,0,0,0,0,0,null,null,"Time-Start"]
[" ",null,null,null,null,null,null,null,null,null,null,null,null,null,null,null,null,null,null,null,null,null,null,null,null,null,"",0,null,0,0,{"$f":"IF(AD13>Data!$J$4,Data!$J$3,IF(AE13>Data!$K$4,Data!$K$3,\" \"))","v":" "},null,{"$f":"RANK(AB13,(AB8:AB15,AB20:AB27),0)","v":1},0,0,0,0,0,0,null,null,"Time-Stop"]
[4,"Quiz-4",null,null,null,null,null,null,null,null,null,null,null,null,null,null,null,null,null,null,null,null,null,null,null,null,"",0,null,0,0,{"$f":"IF(AD14>Data!$J$4,Data!$J$3,IF(AE14>Data!$K$4,Data!$K$3,\" \"))","v":" "},null,{"$f":"RANK(AB14,(AB8:AB15,AB20:AB27),0)","v":1},0,0,0,0,0,0,null,null,"Time-End"]
[" ",null,null,null,null,null,null,null,null,null,null,null,null,null,null,null,null,null,null,null,null,null,null,null,null,null,"",0,null,0,0,{"$f":"IF(AD15>Data!$J$4,Data!$J$3,IF(AE15>Data!$K$4,Data!$K$3,\" \"))","v":" "},null,{"$f":"RANK(AB15,(AB8:AB15,AB20:AB27),0)","v":1},0,0,0,0,0,0,null,null,"Sound-On",null,null,null,null,null,null,"21:32:40"]
[" ","Team Fouls",null,null,null,null,null,null,null,null,null,null,null,null,null,null,null,null,null,null,null,null,null,null,null,null,null,0,null,null,null,{"$f":"AB17","v":0}]
[null,"Running Total",{"$f":"SUM(C8:C16)","v":0},{"$f":"C17+SUM(D8:D16)","v":0},0,0,0,0,0,0,0,0,0,{"$f":"M17+SUM(N8:N16)","v":0},0,0,0,0,0,0,0,0,{"$f":"V17+SUM(W8:W16)","v":0},{"$f":"W17+SUM(X8:X16)","v":0},{"$f":"X17+SUM(Y8:Y16)","v":0},{"$f":"X17+SUM(Z8:Z16)","v":0},{"$f":"Z17+SUM(AA8:AA16)","v":0},{"$f":"SUM(AB8:AB16)","v":0},null,{"$f":"SUM(AD8:AD16)","v":0},{"$f":"SUM(AE8:AE16)","v":0},null,null,null,{"$f":"SUM(AI8:AI15)","v":0},0,0,0,0,0]
[]
[null,"Green Team",null,null,null,null,null,null,"Time-Outs  ",null,null,1,2,3,null,null,"Coach Appeals",null,null,null,1,2,null,null,null,"Fouls","Bonus","Total",null,"Oks","Not","Outs"]
[1,"Quizzer-5",null,null,null,null,null,null,null,null,null,null,null,null,null,null,null,null,null,null,null,null,null,null,null,null,{"$f":"IF(AD20>5,10,\"\")","v":""},{"$f":"SUM(C20:AA20)","v":0},null,{"$f":"COUNTIF(C20:Y20,10)+COUNTIF(C20:Y20,20)+COUNTIF(C20:Y20,30)","v":0},{"$f":"COUNTIF(C20:Y20,-5)+COUNTIF(C20:Y20,-10)+COUNTIF(C20:Y20,-15)","v":0},{"$f":"IF(AD20>Data!$J$4,Data!$J$3,IF(AE20>Data!$K$4,Data!$K$3,\" \"))","v":" "},null,{"$f":"RANK(AB20,(AB8:AB15,AB20:AB27),0)","v":1},{"$f":"COUNTIF(C20:Y20,10)","v":0},{"$f":"COUNTIF(C20:Y20,20)","v":0},0,0,0,{"$f":"COUNTIF(C20:Y20,-15)","v":0}]
[null,null,null,null,null,null,null,null,null,null,null,null,null,null,null,null,null,null,null,null,null,null,null,null,null,null,{"$f":"IF(AD21>5,10,\"\")","v":""},0,null,0,0,{"$f":"IF(AD21>Data!$J$4,Data!$J$3,IF(AE21>Data!$K$4,Data!$K$3,\" \"))","v":" "},null,{"$f":"RANK(AB21,(AB8:AB15,AB20:AB27),0)","v":1},0,0,{"$f":"COUNTIF(C21:Y21,30)","v":0},0,0,0]
[2,"Quizzer-6",null,null,null,null,null,null,null,null,null,null,null,null,null,null,null,null,null,null,null,null,null,null,null,null,"",0,null,0,0,{"$f":"IF(AD22>Data!$J$4,Data!$J$3,IF(AE22>Data!$K$4,Data!$K$3,\" \"))","v":" "},null,{"$f":"RANK(AB22,(AB8:AB15,AB20:AB27),0)","v":1},0,0,0,{"$f":"COUNTIF(C22:Y22,-5)","v":0},{"$f":"COUNTIF(C22:Y22,-10)","v":0},0]
[" ",null,null,null,null,null,null,null,null,null,null,null,null,null,null,null,null,null,null,null,null,null,null,null,null,null,"",0,null,0,0,{"$f":"IF(AD23>Data!$J$4,Data!$J$3,IF(AE23>Data!$K$4,Data!$K$3,\" \"))","v":" "},null,{"$f":"RANK(AB23,(AB8:AB15,AB20:AB27),0)","v":1},0,0,0,0,0,0]
[3,"Quizzer-7",null,null,null,null,null,null,null,null,null,null,null,null,null,null,null,null,null,null,null,null,null,null,null,null,"",0,null,0,0,{"$f":"IF(AD24>Data!$J$4,Data!$J$3,IF(AE24>Data!$K$4,Data!$K$3,\" \"))","v":" "},null,{"$f":"RANK(AB24,(AB8:AB15,AB20:AB27),0)","v":1},0,0,0,0,0,0]
[" ",null,null,null,null,null,null,null,null,null,null,null,null,null,null,null,null,null,null,null,null,null,null,null,null,null,"",0,null,0,0,{"$f":"IF(AD25>Data!$J$4,Data!$J$3,IF(AE25>Data!$K$4,Data!$K$3,\" \"))","v":" "},null,{"$f":"RANK(AB25,(AB8:AB15,AB20:AB27),0)","v":1},0,0,0,0,0,0]
[4,"Quizzer-8",null,null,null,null,null,null,null,null,null,null,null,null,null,null,null,null,null,null,null,null,null,null,null,null,"",0,null,0,0,{"$f":"IF(AD26>Data!$J$4,Data!$J$3,IF(AE26>Data!$K$4,Data!$K$3,\" \"))","v":" "},null,{"$f":"RANK(AB26,(AB8:AB15,AB20:AB27),0)","v":1},0,0,0,0,0,0]
[null,null,null,null,null,null,null,null,null,null,null,null,null,null,null,null,null,null,null,null,null,null,null,null,null,null,"",{"$f":"SUM(C27:AA27)","v":0},null,0,0,{"$f":"IF(AD27>Data!$J$4,Data!$J$3,IF(AE27>Data!$K$4,Data!$K$3,\" \"))","v":" "},null,{"$f":"RANK(AB27,(AB8:AB15,AB20:AB27),0)","v":1},0,0,0,0,0,0]
[" ","Team Fouls",null,null,null,null,null,null,null,null,null,null,null,null,null,null,null,null,null,null,null,null,null,null,null,null,null,0,null,"f",null,{"$f":"AB29","v":0}]
[null,"Running Total",{"$f":"SUM(C20:C28)","v":0},{"$f":"C29+SUM(D20:D28)","v":0},0,0,0,0,0,0,0,0,0,0,0,0,0,0,0,0,0,0,0,0,0,0,0,{"$f":"SUM(AB20:AB28)","v":0},null,{"$f":"SUM(AD20:AD28)","v":0},{"$f":"SUM(AE20:AE28)","v":0},null,null,null,{"$f":"SUM(AI20:AI27)","v":0},0,0,0,0,0]
[]
[null," ","   No Scores",null,null,null,null,null,null,null,null,null,"1st Place Team : ",null,null,null,{"$f":"IF(AD17>=AD29,B7,B19)","v":"Red Team"},null,null,null,null,null,"Score : ",null,{"$f":"MAXA(AB17,AB29)","v":0},"Score Difference:",null,null,null,null,null,{"$f":"IF(AB17>AB29,AB17-AB29,AB29-AB17)","v":0},null," ",null,null,null,null,"Not Clear"]
[null,null,null,null,null,null,null,null,null,null,null,null,"2nd Place Team : ",null,null,null,{"$f":"IF(AD17>=AD29,B19,B7)","v":"Green Team"},null,null,null,null,null,"Score : ",null,{"$f":"MINA(AB17,AB29)","v":0}]
[null,null,null,null,null,null,null,null,null,null,null,null,null,null,null,null,null,null,null,null,null,"Difference : ",null,null,{"$f":"Y31-Y32","v":0}]
[]
[]
[]
[null,null,null,null,null,null,null,null,null,null,null,null,"Timer Start",null,null,null,"00:07:30",null,null,null,"Foul Time",null,null,"Foul#","Q#","Foul",null,"User"]
[null,null,null,null,null,null,null,null,null,null,null,null,"Timer Now"]
[null,null,null,null,null,null,null,null,null,null,null,null,"Timer End  ",null,null,null," "]
[null,null,null,null,null,null,null,null,null,null,null,null,"Timer Stop ",null,null,null,"00:07:32"]
[null,null,null,null,null,null,null,null,null,null,null,null,null,null,null,null,"21:32:42"]

{"sheet":"R_7","index":6,"n_rows":41,"n_cols":51,"rows_kept":41,"cut":false,"hidden":false,"merged":[[1,4,1,5],[1,33,1,34],[2,33,2,34],[3,33,3,34],[4,25,5,26],[4,27,4,29],[4,30,4,32],[4,34,4,36],[6,8,6,10],[6,14,6,15],[6,16,6,19],[6,31,6,32],[0,6,1,7],[0,33,0,34],[18,8,18,10],[18,14,18,15],[18,16,18,19],[18,31,18,32],[7,31,7,32],[8,31,8,32],[9,31,9,32],[10,31,10,32],[11,31,11,32],[12,31,12,32],[19,31,19,32],[20,31,20,32],[21,31,21,32],[22,31,22,32],[23,31,23,32],[24,31,24,32],[13,31,13,32],[14,31,14,32],[15,31,16,32],[25,31,25,32],[26,31,26,32],[27,31,28,32],[30,2,30,7],[30,8,30,9],[30,12,30,15],[30,16,30,21],[30,22,30,23],[30,25,31,30],[30,31,31,32],[32,2,32,7],[32,8,32,9],[32,21,32,23],[33,2,33,7],[33,8,33,9],[34,2,34,7],[34,8,34,9],[30,38,30,40],[31,2,31,7],[31,8,31,9],[31,12,31,15],[31,16,31,21],[31,22,31,23],[35,2,35,7],[35,8,35,9],[35,16,35,18],[35,20,35,25],[36,2,36,7],[36,8,36,9],[36,12,36,15],[36,16,36,18],[36,20,36,22],[37,2,37,7],[37,8,37,9],[37,12,37,15],[37,16,37,18],[37,20,37,22],[38,2,38,7],[38,8,38,9],[38,12,38,15],[38,16,38,18],[38,20,38,22],[41,2,41,7],[41,8,41,9],[41,16,41,18],[41,20,41,22],[42,2,42,7],[42,8,42,9],[42,16,42,18],[42,20,42,22],[39,2,39,7],[39,8,39,9],[39,12,39,15],[39,16,39,18],[39,20,39,22],[40,2,40,7],[40,8,40,9],[40,16,40,18],[40,20,40,22],[45,2,45,7],[45,8,45,9],[45,16,45,18],[45,20,45,22],[43,2,43,7],[43,8,43,9],[43,16,43,18],[43,20,43,22],[44,2,44,7],[44,8,44,9],[44,16,44,18],[44,20,44,22]]}
[null,"JBQ Round",7,null,null,null,0,null,30,null,null,null,null,null,null,null,null,null,null,null,null,null,null,null,null,null,null,null,null,null,null,null,null,"Coach Help",null,"10's","20's","30's","Points","Negs","Red",null,"SetC",null,null,null,null,null,null,"Cleared"]
[null,"JBQ Room",null,null,"Stop",null,null,null,null,null,null,null,null,null,null,null,null,null,null,null,null,null,null,null,null,null,null,null,null,null,null,null,null,"Asked",null,{"$f":"COUNTIF($C6:$Y6,10)","v":0},{"$f":"COUNTIF($C6:$Y6,20)","v":0},{"$f":"COUNTIF($C6:$Y6,30)","v":0},{"$f":"(AJ2*10)+(AK2*20)+(AL2*30)","v":0},{"$f":"(AJ2*-5)+(AK2*-10)+(AL2*-15)","v":0},null,null,null,null,null,null,null,null,null,null,"Sounds\\tada.wav"]
[null,"JBQ Division",null,null,null,null,null,null,null,null,null,null,null,null,null,null,null,null,null,null,null,null,null,null,null,null,null,null,null,null,null,null,null,"Max",null,10,7,3,{"$f":"(AJ3*10)+(AK3*20)+(AL3*30)","v":330},{"$f":"(AJ3*-5)+(AK3*-10)+(AL3*-15)","v":-165},0,null,null,null,null,null,null,null,null,"Wave Play"]
[null,"Interrupt",null,null,null,null,null,null,null,null,null,null,null,null,null,null,null,null,null,null,null,null,null,null,null,null,null,null,null,null,null,null,null,"Remaining",null,{"$f":"AJ3-AJ2","v":10},{"$f":"AK3-AK2","v":7},{"$f":"AL3-AL2","v":3},{"$f":"(AJ4*10)+(AK4*20)+(AL4*30)","v":330},{"$f":"(AJ4*-5)+(AK4*-10)+(AL4*-15)","v":-165},0,null,null,null,null,null,null,null,null,"Sounds\\tada.wav"]
[0,"Question Number",1,{"$f":"C5+1","v":2},{"$f":"D5+1","v":3},4,5,6,7,8,9,10,11,12,13,14,15,16,17,18,19,20,"ot1","ot2","ot3",0,null,"Time Start",null,null,"00:07:30",null,null,"Now","00:07:33",null,null,null,null,null,null,null,null,null,null,null,null,null,null,"Wave No File"]
[null,"Point Value ",null,null,null,null,null,null,null,null,null,null,null,null,null,null,null,null,null,null,null,null,null,null,null,null,null,null,null,"Cnt","Cnt",null,null,null,"Cnt","Cnt","Cnt","Cnt","Cnt","Cnt",null,null,null,null,null,null,null,null,null,"C:\\AA\\CedarPark\\JBQ1\\Sounds\\tada.wav"]
[null,"Red Team",null,null,null,null,null,null,"Time-Outs  ",null,null,1,2,3,null,null,"Coach Appeals",null,null,null,1,2,null,null,null,"Fouls","Bonus","Total",null,"Oks","Not","Outs",null,"Rank","10's","20's","30's","-5's","-10's","-15's",null,null,"Neg",null,null,null,null,null,null,"Wave Playing"]
[1,"Quiz-1",null,null,null,null,null,null,null,null,null,null,null,null,null,null,null,null,null,null,null,null,null,null,null,null,{"$f":"IF(AD8>5,10,\"\")","v":""},{"$f":"SUM(C8:AA8)","v":0},null,{"$f":"COUNTIF(C8:Y8,10)+COUNTIF(C8:Y8,20)+COUNTIF(C8:Y8,30)","v":0},{"$f":"COUNTIF(C8:Y8,-5)+COUNTIF(C8:Y8,-10)+COUNTIF(C8:Y8,-15)","v":0},{"$f":"IF(AD8>Data!$J$4,Data!$J$3,IF(AE8>Data!$K$4,Data!$K$3,\" \"))","v":" "},null,{"$f":"RANK(AB8,(AB8:AB15,AB20:AB27),0)","v":1},{"$f":"COUNTIF(C8:Y8,10)","v":0},{"$f":"COUNTIF(C8:Y8,20)","v":0},{"$f":"COUNTIF(C8:Y8,30)","v":0},{"$f":"COUNTIF(C8:Y8,-5)","v":0},{"$f":"COUNTIF(C8:Y8,-10)","v":0},{"$f":"COUNTIF(C8:Y8,-15)","v":0},null,null,"Plus",5,null,null,null,null,null,"Wave Waiting"]
[null,null,null,null,null,null,null,null,null,null,null,null,null,null,null,null,null,null,null,null,null,null,null,null,null,null,{"$f":"IF(AD9>5,10,\"\")","v":""},{"$f":"SUM(C9:AA9)","v":0},null,{"$f":"COUNTIF(C9:Y9,10)+COUNTIF(C9:Y9,20)+COUNTIF(C9:Y9,30)","v":0},{"$f":"COUNTIF(C9:Y9,-5)+COUNTIF(C9:Y9,-10)+COUNTIF(C9:Y9,-15)","v":0},{"$f":"IF(AD9>Data!$J$4,Data!$J$3,IF(AE9>Data!$K$4,Data!$K$3,\" \"))","v":" "},null,{"$f":"RANK(AB9,(AB8:AB15,AB20:AB27),0)","v":1},{"$f":"COUNTIF(C9:Y9,10)","v":0},{"$f":"COUNTIF(C9:Y9,20)","v":0},{"$f":"COUNTIF(C9:Y9,30)","v":0},{"$f":"COUNTIF(C9:Y9,-5)","v":0},{"$f":"COUNTIF(C9:Y9,-10)","v":0},{"$f":"COUNTIF(C9:Y9,-15)","v":0},null,null,"Quiz-Out",4,null,null,null,null,null,"Wave Ending"]
[2,"Quiz-2",null,null,null,null,null,null,null,null,null,null,null,null,null,null,null,null,null,null,null,null,null,null,null,null,"",{"$f":"SUM(C10:AA10)","v":0},null,0,0,{"$f":"IF(AD10>Data!$J$4,Data!$J$3,IF(AE10>Data!$K$4,Data!$K$3,\" \"))","v":" "},null,{"$f":"RANK(AB10,(AB8:AB15,AB20:AB27),0)","v":1},0,0,0,0,0,0,null,null,"Minus",1]
[" ",null,null,null,null,null,null,null,null,null,null,null,null,null,null,null,null,null,null,null,null,null,null,null,null,null,"",{"$f":"SUM(C11:AA11)","v":0},null,0,0,{"$f":"IF(AD11>Data!$J$4,Data!$J$3,IF(AE11>Data!$K$4,Data!$K$3,\" \"))","v":" "},null,{"$f":"RANK(AB11,(AB8:AB15,AB20:AB27),0)","v":1},0,0,0,0,0,0,null,null,"Fizz-Out",2]
[3,"Quiz-3",null,null,null,null,null,null,null,null,null,null,null,null,null,null,null,null,null,null,null,null,null,null,null,null,"",0,null,0,0,{"$f":"IF(AD12>Data!$J$4,Data!$J$3,IF(AE12>Data!$K$4,Data!$K$3,\" \"))","v":" "},null,{"$f":"RANK(AB12,(AB8:AB15,AB20:AB27),0)","v":1},0,0,0,0,0,0,null,null,"Time-Start"]
[" ",null,null,null,null,null,null,null,null,null,null,null,null,null,null,null,null,null,null,null,null,null,null,null,null,null,"",0,null,0,0,{"$f":"IF(AD13>Data!$J$4,Data!$J$3,IF(AE13>Data!$K$4,Data!$K$3,\" \"))","v":" "},null,{"$f":"RANK(AB13,(AB8:AB15,AB20:AB27),0)","v":1},0,0,0,0,0,0,null,null,"Time-Stop"]
[4,"Quiz-4",null,null,null,null,null,null,null,null,null,null,null,null,null,null,null,null,null,null,null,null,null,null,null,null,"",0,null,0,0,{"$f":"IF(AD14>Data!$J$4,Data!$J$3,IF(AE14>Data!$K$4,Data!$K$3,\" \"))","v":" "},null,{"$f":"RANK(AB14,(AB8:AB15,AB20:AB27),0)","v":1},0,0,0,0,0,0,null,null,"Time-End"]
[" ",null,null,null,null,null,null,null,null,null,null,null,null,null,null,null,null,null,null,null,null,null,null,null,null,null,"",0,null,0,0,{"$f":"IF(AD15>Data!$J$4,Data!$J$3,IF(AE15>Data!$K$4,Data!$K$3,\" \"))","v":" "},null,{"$f":"RANK(AB15,(AB8:AB15,AB20:AB27),0)","v":1},0,0,0,0,0,0,null,null,"Sound-On",null,null,null,null,null,null,"21:32:40"]
[" ","Team Fouls",null,null,null,null,null,null,null,null,null,null,null,null,null,null,null,null,null,null,null,null,null,null,null,null,null,0,null,null,null,{"$f":"AB17","v":0}]
[null,"Running Total",{"$f":"SUM(C8:C16)","v":0},{"$f":"C17+SUM(D8:D16)","v":0},0,0,0,0,0,0,0,0,0,{"$f":"M17+SUM(N8:N16)","v":0},0,0,0,0,0,0,0,0,{"$f":"V17+SUM(W8:W16)","v":0},{"$f":"W17+SUM(X8:X16)","v":0},{"$f":"X17+SUM(Y8:Y16)","v":0},{"$f":"X17+SUM(Z8:Z16)","v":0},{"$f":"Z17+SUM(AA8:AA16)","v":0},{"$f":"SUM(AB8:AB16)","v":0},null,{"$f":"SUM(AD8:AD16)","v":0},{"$f":"SUM(AE8:AE16)","v":0},null,null,null,{"$f":"SUM(AI8:AI15)","v":0},0,0,0,0,0]
[]
[null,"Green Team",null,null,null,null,null,null,"Time-Outs  ",null,null,1,2,3,null,null,"Coach Appeals",null,null,null,1,2,null,null,null,"Fouls","Bonus","Total",null,"Oks","Not","Outs"]
[1,"Quizzer-5",null,null,null,null,null,null,null,null,null,null,null,null,null,null,null,null,null,null,null,null,null,null,null,null,{"$f":"IF(AD20>5,10,\"\")","v":""},{"$f":"SUM(C20:AA20)","v":0},null,{"$f":"COUNTIF(C20:Y20,10)+COUNTIF(C20:Y20,20)+COUNTIF(C20:Y20,30)","v":0},{"$f":"COUNTIF(C20:Y20,-5)+COUNTIF(C20:Y20,-10)+COUNTIF(C20:Y20,-15)","v":0},{"$f":"IF(AD20>Data!$J$4,Data!$J$3,IF(AE20>Data!$K$4,Data!$K$3,\" \"))","v":" "},null,{"$f":"RANK(AB20,(AB8:AB15,AB20:AB27),0)","v":1},{"$f":"COUNTIF(C20:Y20,10)","v":0},{"$f":"COUNTIF(C20:Y20,20)","v":0},0,0,0,{"$f":"COUNTIF(C20:Y20,-15)","v":0}]
[null,null,null,null,null,null,null,null,null,null,null,null,null,null,null,null,null,null,null,null,null,null,null,null,null,null,{"$f":"IF(AD21>5,10,\"\")","v":""},0,null,0,0,{"$f":"IF(AD21>Data!$J$4,Data!$J$3,IF(AE21>Data!$K$4,Data!$K$3,\" \"))","v":" "},null,{"$f":"RANK(AB21,(AB8:AB15,AB20:AB27),0)","v":1},0,0,{"$f":"COUNTIF(C21:Y21,30)","v":0},0,0,0]
[2,"Quizzer-6",null,null,null,null,null,null,null,null,null,null,null,null,null,null,null,null,null,null,null,null,null,null,null,null,"",0,null,0,0,{"$f":"IF(AD22>Data!$J$4,Data!$J$3,IF(AE22>Data!$K$4,Data!$K$3,\" \"))","v":" "},null,{"$f":"RANK(AB22,(AB8:AB15,AB20:AB27),0)","v":1},0,0,0,{"$f":"COUNTIF(C22:Y22,-5)","v":0},{"$f":"COUNTIF(C22:Y22,-10)","v":0},0]
[" ",null,null,null,null,null,null,null,null,null,null,null,null,null,null,null,null,null,null,null,null,null,null,null,null,null,"",0,null,0,0,{"$f":"IF(AD23>Data!$J$4,Data!$J$3,IF(AE23>Data!$K$4,Data!$K$3,\" \"))","v":" "},null,{"$f":"RANK(AB23,(AB8:AB15,AB20:AB27),0)","v":1},0,0,0,0,0,0]
[3,"Quizzer-7",null,null,null,null,null,null,null,null,null,null,null,null,null,null,null,null,null,null,null,null,null,null,null,null,"",0,null,0,0,{"$f":"IF(AD24>Data!$J$4,Data!$J$3,IF(AE24>Data!$K$4,Data!$K$3,\" \"))","v":" "},null,{"$f":"RANK(AB24,(AB8:AB15,AB20:AB27),0)","v":1},0,0,0,0,0,0]
[" ",null,null,null,null,null,null,null,null,null,null,null,null,null,null,null,null,null,null,null,null,null,null,null,null,null,"",0,null,0,0,{"$f":"IF(AD25>Data!$J$4,Data!$J$3,IF(AE25>Data!$K$4,Data!$K$3,\" \"))","v":" "},null,{"$f":"RANK(AB25,(AB8:AB15,AB20:AB27),0)","v":1},0,0,0,0,0,0]
[4,"Quizzer-8",null,null,null,null,null,null,null,null,null,null,null,null,null,null,null,null,null,null,null,null,null,null,null,null,"",0,null,0,0,{"$f":"IF(AD26>Data!$J$4,Data!$J$3,IF(AE26>Data!$K$4,Data!$K$3,\" \"))","v":" "},null,{"$f":"RANK(AB26,(AB8:AB15,AB20:AB27),0)","v":1},0,0,0,0,0,0]
[null,null,null,null,null,null,null,null,null,null,null,null,null,null,null,null,null,null,null,null,null,null,null,null,null,null,"",{"$f":"SUM(C27:AA27)","v":0},null,0,0,{"$f":"IF(AD27>Data!$J$4,Data!$J$3,IF(AE27>Data!$K$4,Data!$K$3,\" \"))","v":" "},null,{"$f":"RANK(AB27,(AB8:AB15,AB20:AB27),0)","v":1},0,0,0,0,0,0]
[" ","Team Fouls",null,null,null,null,null,null,null,null,null,null,null,null,null,null,null,null,null,null,null,null,null,null,null,null,null,0,null,"f",null,{"$f":"AB29","v":0}]
[null,"Running Total",{"$f":"SUM(C20:C28)","v":0},{"$f":"C29+SUM(D20:D28)","v":0},0,0,0,0,0,0,0,0,0,0,0,0,0,0,0,0,0,0,0,0,0,0,0,{"$f":"SUM(AB20:AB28)","v":0},null,{"$f":"SUM(AD20:AD28)","v":0},{"$f":"SUM(AE20:AE28)","v":0},null,null,null,{"$f":"SUM(AI20:AI27)","v":0},0,0,0,0,0]
[]
[null," ","   No Scores",null,null,null,null,null,null,null,null,null,"1st Place Team : ",null,null,null,{"$f":"IF(AD17>=AD29,B7,B19)","v":"Red Team"},null,null,null,null,null,"Score : ",null,{"$f":"MAXA(AB17,AB29)","v":0},"Score Difference:",null,null,null,null,null,{"$f":"IF(AB17>AB29,AB17-AB29,AB29-AB17)","v":0},null," ",null,null,null,null,"Not Clear"]
[null,null,null,null,null,null,null,null,null,null,null,null,"2nd Place Team : ",null,null,null,{"$f":"IF(AD17>=AD29,B19,B7)","v":"Green Team"},null,null,null,null,null,"Score : ",null,{"$f":"MINA(AB17,AB29)","v":0}]
[null,null,null,null,null,null,null,null,null,null,null,null,null,null,null,null,null,null,null,null,null,"Difference : ",null,null,{"$f":"Y31-Y32","v":0}]
[]
[]
[]
[null,null,null,null,null,null,null,null,null,null,null,null,"Timer Start",null,null,null,"00:07:30",null,null,null,"Foul Time",null,null,"Foul#","Q#","Foul",null,"User"]
[null,null,null,null,null,null,null,null,null,null,null,null,"Timer Now"]
[null,null,null,null,null,null,null,null,null,null,null,null,"Timer End  ",null,null,null," "]
[null,null,null,null,null,null,null,null,null,null,null,null,"Timer Stop ",null,null,null,"00:07:32"]
[null,null,null,null,null,null,null,null,null,null,null,null,null,null,null,null,"21:32:42"]

{"sheet":"R_8","index":7,"n_rows":41,"n_cols":51,"rows_kept":41,"cut":false,"hidden":false,"merged":[[1,4,1,5],[1,33,1,34],[2,33,2,34],[3,33,3,34],[4,25,5,26],[4,27,4,29],[4,30,4,32],[4,34,4,36],[6,8,6,10],[6,14,6,15],[6,16,6,19],[6,31,6,32],[0,6,1,7],[0,33,0,34],[18,8,18,10],[18,14,18,15],[18,16,18,19],[18,31,18,32],[7,31,7,32],[8,31,8,32],[9,31,9,32],[10,31,10,32],[11,31,11,32],[12,31,12,32],[19,31,19,32],[20,31,20,32],[21,31,21,32],[22,31,22,32],[23,31,23,32],[24,31,24,32],[13,31,13,32],[14,31,14,32],[15,31,16,32],[25,31,25,32],[26,31,26,32],[27,31,28,32],[30,2,30,7],[30,8,30,9],[30,12,30,15],[30,16,30,21],[30,22,30,23],[30,25,31,30],[30,31,31,32],[32,2,32,7],[32,8,32,9],[32,21,32,23],[33,2,33,7],[33,8,33,9],[34,2,34,7],[34,8,34,9],[30,38,30,40],[31,2,31,7],[31,8,31,9],[31,12,31,15],[31,16,31,21],[31,22,31,23],[35,2,35,7],[35,8,35,9],[35,16,35,18],[35,20,35,25],[36,2,36,7],[36,8,36,9],[36,12,36,15],[36,16,36,18],[36,20,36,22],[37,2,37,7],[37,8,37,9],[37,12,37,15],[37,16,37,18],[37,20,37,22],[38,2,38,7],[38,8,38,9],[38,12,38,15],[38,16,38,18],[38,20,38,22],[41,2,41,7],[41,8,41,9],[41,16,41,18],[41,20,41,22],[42,2,42,7],[42,8,42,9],[42,16,42,18],[42,20,42,22],[39,2,39,7],[39,8,39,9],[39,12,39,15],[39,16,39,18],[39,20,39,22],[40,2,40,7],[40,8,40,9],[40,16,40,18],[40,20,40,22],[45,2,45,7],[45,8,45,9],[45,16,45,18],[45,20,45,22],[43,2,43,7],[43,8,43,9],[43,16,43,18],[43,20,43,22],[44,2,44,7],[44,8,44,9],[44,16,44,18],[44,20,44,22]]}
[null,"JBQ Round",8,null,null,null,0,null,30,null,null,null,null,null,null,null,null,null,null,null,null,null,null,null,null,null,null,null,null,null,null,null,null,"Coach Help",null,"10's","20's","30's","Points","Negs","Red",null,"SetC",null,null,null,null,null,null,"Cleared"]
[null,"JBQ Room",null,null,"Stop",null,null,null,null,null,null,null,null,null,null,null,null,null,null,null,null,null,null,null,null,null,null,null,null,null,null,null,null,"Asked",null,{"$f":"COUNTIF($C6:$Y6,10)","v":0},{"$f":"COUNTIF($C6:$Y6,20)","v":0},{"$f":"COUNTIF($C6:$Y6,30)","v":0},{"$f":"(AJ2*10)+(AK2*20)+(AL2*30)","v":0},{"$f":"(AJ2*-5)+(AK2*-10)+(AL2*-15)","v":0},null,null,null,null,null,null,null,null,null,null,"Sounds\\tada.wav"]
[null,"JBQ Division",null,null,null,null,null,null,null,null,null,null,null,null,null,null,null,null,null,null,null,null,null,null,null,null,null,null,null,null,null,null,null,"Max",null,10,7,3,{"$f":"(AJ3*10)+(AK3*20)+(AL3*30)","v":330},{"$f":"(AJ3*-5)+(AK3*-10)+(AL3*-15)","v":-165},0,null,null,null,null,null,null,null,null,"Wave Play"]
[null,"Interrupt",null,null,null,null,null,null,null,null,null,null,null,null,null,null,null,null,null,null,null,null,null,null,null,null,null,null,null,null,null,null,null,"Remaining",null,{"$f":"AJ3-AJ2","v":10},{"$f":"AK3-AK2","v":7},{"$f":"AL3-AL2","v":3},{"$f":"(AJ4*10)+(AK4*20)+(AL4*30)","v":330},{"$f":"(AJ4*-5)+(AK4*-10)+(AL4*-15)","v":-165},0,null,null,null,null,null,null,null,null,"Sounds\\tada.wav"]
[0,"Question Number",1,{"$f":"C5+1","v":2},{"$f":"D5+1","v":3},4,5,6,7,8,9,10,11,12,13,14,15,16,17,18,19,20,"ot1","ot2","ot3",0,null,"Time Start",null,null,"00:07:30",null,null,"Now","00:07:33",null,null,null,null,null,null,null,null,null,null,null,null,null,null,"Wave No File"]
[null,"Point Value ",null,null,null,null,null,null,null,null,null,null,null,null,null,null,null,null,null,null,null,null,null,null,null,null,null,null,null,"Cnt","Cnt",null,null,null,"Cnt","Cnt","Cnt","Cnt","Cnt","Cnt",null,null,null,null,null,null,null,null,null,"C:\\AA\\CedarPark\\JBQ1\\Sounds\\tada.wav"]
[null,"Red Team",null,null,null,null,null,null,"Time-Outs  ",null,null,1,2,3,null,null,"Coach Appeals",null,null,null,1,2,null,null,null,"Fouls","Bonus","Total",null,"Oks","Not","Outs",null,"Rank","10's","20's","30's","-5's","-10's","-15's",null,null,"Neg",null,null,null,null,null,null,"Wave Playing"]
[1,"Quiz-1",null,null,null,null,null,null,null,null,null,null,null,null,null,null,null,null,null,null,null,null,null,null,null,null,{"$f":"IF(AD8>5,10,\"\")","v":""},{"$f":"SUM(C8:AA8)","v":0},null,{"$f":"COUNTIF(C8:Y8,10)+COUNTIF(C8:Y8,20)+COUNTIF(C8:Y8,30)","v":0},{"$f":"COUNTIF(C8:Y8,-5)+COUNTIF(C8:Y8,-10)+COUNTIF(C8:Y8,-15)","v":0},{"$f":"IF(AD8>Data!$J$4,Data!$J$3,IF(AE8>Data!$K$4,Data!$K$3,\" \"))","v":" "},null,{"$f":"RANK(AB8,(AB8:AB15,AB20:AB27),0)","v":1},{"$f":"COUNTIF(C8:Y8,10)","v":0},{"$f":"COUNTIF(C8:Y8,20)","v":0},{"$f":"COUNTIF(C8:Y8,30)","v":0},{"$f":"COUNTIF(C8:Y8,-5)","v":0},{"$f":"COUNTIF(C8:Y8,-10)","v":0},{"$f":"COUNTIF(C8:Y8,-15)","v":0},null,null,"Plus",5,null,null,null,null,null,"Wave Waiting"]
[null,null,null,null,null,null,null,null,null,null,null,null,null,null,null,null,null,null,null,null,null,null,null,null,null,null,{"$f":"IF(AD9>5,10,\"\")","v":""},{"$f":"SUM(C9:AA9)","v":0},null,{"$f":"COUNTIF(C9:Y9,10)+COUNTIF(C9:Y9,20)+COUNTIF(C9:Y9,30)","v":0},{"$f":"COUNTIF(C9:Y9,-5)+COUNTIF(C9:Y9,-10)+COUNTIF(C9:Y9,-15)","v":0},{"$f":"IF(AD9>Data!$J$4,Data!$J$3,IF(AE9>Data!$K$4,Data!$K$3,\" \"))","v":" "},null,{"$f":"RANK(AB9,(AB8:AB15,AB20:AB27),0)","v":1},{"$f":"COUNTIF(C9:Y9,10)","v":0},{"$f":"COUNTIF(C9:Y9,20)","v":0},{"$f":"COUNTIF(C9:Y9,30)","v":0},{"$f":"COUNTIF(C9:Y9,-5)","v":0},{"$f":"COUNTIF(C9:Y9,-10)","v":0},{"$f":"COUNTIF(C9:Y9,-15)","v":0},null,null,"Quiz-Out",4,null,null,null,null,null,"Wave Ending"]
[2,"Quiz-2",null,null,null,null,null,null,null,null,null,null,null,null,null,null,null,null,null,null,null,null,null,null,null,null,"",{"$f":"SUM(C10:AA10)","v":0},null,0,0,{"$f":"IF(AD10>Data!$J$4,Data!$J$3,IF(AE10>Data!$K$4,Data!$K$3,\" \"))","v":" "},null,{"$f":"RANK(AB10,(AB8:AB15,AB20:AB27),0)","v":1},0,0,0,0,0,0,null,null,"Minus",1]
[" ",null,null,null,null,null,null,null,null,null,null,null,null,null,null,null,null,null,null,null,null,null,null,null,null,null,"",{"$f":"SUM(C11:AA11)","v":0},null,0,0,{"$f":"IF(AD11>Data!$J$4,Data!$J$3,IF(AE11>Data!$K$4,Data!$K$3,\" \"))","v":" "},null,{"$f":"RANK(AB11,(AB8:AB15,AB20:AB27),0)","v":1},0,0,0,0,0,0,null,null,"Fizz-Out",2]
[3,"Quiz-3",null,null,null,null,null,null,null,null,null,null,null,null,null,null,null,null,null,null,null,null,null,null,null,null,"",0,null,0,0,{"$f":"IF(AD12>Data!$J$4,Data!$J$3,IF(AE12>Data!$K$4,Data!$K$3,\" \"))","v":" "},null,{"$f":"RANK(AB12,(AB8:AB15,AB20:AB27),0)","v":1},0,0,0,0,0,0,null,null,"Time-Start"]
[" ",null,null,null,null,null,null,null,null,null,null,null,null,null,null,null,null,null,null,null,null,null,null,null,null,null,"",0,null,0,0,{"$f":"IF(AD13>Data!$J$4,Data!$J$3,IF(AE13>Data!$K$4,Data!$K$3,\" \"))","v":" "},null,{"$f":"RANK(AB13,(AB8:AB15,AB20:AB27),0)","v":1},0,0,0,0,0,0,null,null,"Time-Stop"]
[4,"Quiz-4",null,null,null,null,null,null,null,null,null,null,null,null,null,null,null,null,null,null,null,null,null,null,null,null,"",0,null,0,0,{"$f":"IF(AD14>Data!$J$4,Data!$J$3,IF(AE14>Data!$K$4,Data!$K$3,\" \"))","v":" "},null,{"$f":"RANK(AB14,(AB8:AB15,AB20:AB27),0)","v":1},0,0,0,0,0,0,null,null,"Time-End"]
[" ",null,null,null,null,null,null,null,null,null,null,null,null,null,null,null,null,null,null,null,null,null,null,null,null,null,"",0,null,0,0,{"$f":"IF(AD15>Data!$J$4,Data!$J$3,IF(AE15>Data!$K$4,Data!$K$3,\" \"))","v":" "},null,{"$f":"RANK(AB15,(AB8:AB15,AB20:AB27),0)","v":1},0,0,0,0,0,0,null,null,"Sound-On",null,null,null,null,null,null,"21:32:40"]
[" ","Team Fouls",null,null,null,null,null,null,null,null,null,null,null,null,null,null,null,null,null,null,null,null,null,null,null,null,null,0,null,null,null,{"$f":"AB17","v":0}]
[null,"Running Total",{"$f":"SUM(C8:C16)","v":0},{"$f":"C17+SUM(D8:D16)","v":0},0,0,0,0,0,0,0,0,0,{"$f":"M17+SUM(N8:N16)","v":0},0,0,0,0,0,0,0,0,{"$f":"V17+SUM(W8:W16)","v":0},{"$f":"W17+SUM(X8:X16)","v":0},{"$f":"X17+SUM(Y8:Y16)","v":0},{"$f":"X17+SUM(Z8:Z16)","v":0},{"$f":"Z17+SUM(AA8:AA16)","v":0},{"$f":"SUM(AB8:AB16)","v":0},null,{"$f":"SUM(AD8:AD16)","v":0},{"$f":"SUM(AE8:AE16)","v":0},null,null,null,{"$f":"SUM(AI8:AI15)","v":0},0,0,0,0,0]
[]
[null,"Green Team",null,null,null,null,null,null,"Time-Outs  ",null,null,1,2,3,null,null,"Coach Appeals",null,null,null,1,2,null,null,null,"Fouls","Bonus","Total",null,"Oks","Not","Outs"]
[1,"Quizzer-5",null,null,null,null,null,null,null,null,null,null,null,null,null,null,null,null,null,null,null,null,null,null,null,null,{"$f":"IF(AD20>5,10,\"\")","v":""},{"$f":"SUM(C20:AA20)","v":0},null,{"$f":"COUNTIF(C20:Y20,10)+COUNTIF(C20:Y20,20)+COUNTIF(C20:Y20,30)","v":0},{"$f":"COUNTIF(C20:Y20,-5)+COUNTIF(C20:Y20,-10)+COUNTIF(C20:Y20,-15)","v":0},{"$f":"IF(AD20>Data!$J$4,Data!$J$3,IF(AE20>Data!$K$4,Data!$K$3,\" \"))","v":" "},null,{"$f":"RANK(AB20,(AB8:AB15,AB20:AB27),0)","v":1},{"$f":"COUNTIF(C20:Y20,10)","v":0},{"$f":"COUNTIF(C20:Y20,20)","v":0},0,0,0,{"$f":"COUNTIF(C20:Y20,-15)","v":0}]
[null,null,null,null,null,null,null,null,null,null,null,null,null,null,null,null,null,null,null,null,null,null,null,null,null,null,{"$f":"IF(AD21>5,10,\"\")","v":""},0,null,0,0,{"$f":"IF(AD21>Data!$J$4,Data!$J$3,IF(AE21>Data!$K$4,Data!$K$3,\" \"))","v":" "},null,{"$f":"RANK(AB21,(AB8:AB15,AB20:AB27),0)","v":1},0,0,{"$f":"COUNTIF(C21:Y21,30)","v":0},0,0,0]
[2,"Quizzer-6",null,null,null,null,null,null,null,null,null,null,null,null,null,null,null,null,null,null,null,null,null,null,null,null,"",0,null,0,0,{"$f":"IF(AD22>Data!$J$4,Data!$J$3,IF(AE22>Data!$K$4,Data!$K$3,\" \"))","v":" "},null,{"$f":"RANK(AB22,(AB8:AB15,AB20:AB27),0)","v":1},0,0,0,{"$f":"COUNTIF(C22:Y22,-5)","v":0},{"$f":"COUNTIF(C22:Y22,-10)","v":0},0]
[" ",null,null,null,null,null,null,null,null,null,null,null,null,null,null,null,null,null,null,null,null,null,null,null,null,null,"",0,null,0,0,{"$f":"IF(AD23>Data!$J$4,Data!$J$3,IF(AE23>Data!$K$4,Data!$K$3,\" \"))","v":" "},null,{"$f":"RANK(AB23,(AB8:AB15,AB20:AB27),0)","v":1},0,0,0,0,0,0]
[3,"Quizzer-7",null,null,null,null,null,null,null,null,null,null,null,null,null,null,null,null,null,null,null,null,null,null,null,null,"",0,null,0,0,{"$f":"IF(AD24>Data!$J$4,Data!$J$3,IF(AE24>Data!$K$4,Data!$K$3,\" \"))","v":" "},null,{"$f":"RANK(AB24,(AB8:AB15,AB20:AB27),0)","v":1},0,0,0,0,0,0]
[" ",null,null,null,null,null,null,null,null,null,null,null,null,null,null,null,null,null,null,null,null,null,null,null,null,null,"",0,null,0,0,{"$f":"IF(AD25>Data!$J$4,Data!$J$3,IF(AE25>Data!$K$4,Data!$K$3,\" \"))","v":" "},null,{"$f":"RANK(AB25,(AB8:AB15,AB20:AB27),0)","v":1},0,0,0,0,0,0]
[4,"Quizzer-8",null,null,null,null,null,null,null,null,null,null,null,null,null,null,null,null,null,null,null,null,null,null,null,null,"",0,null,0,0,{"$f":"IF(AD26>Data!$J$4,Data!$J$3,IF(AE26>Data!$K$4,Data!$K$3,\" \"))","v":" "},null,{"$f":"RANK(AB26,(AB8:AB15,AB20:AB27),0)","v":1},0,0,0,0,0,0]
[null,null,null,null,null,null,null,null,null,null,null,null,null,null,null,null,null,null,null,null,null,null,null,null,null,null,"",{"$f":"SUM(C27:AA27)","v":0},null,0,0,{"$f":"IF(AD27>Data!$J$4,Data!$J$3,IF(AE27>Data!$K$4,Data!$K$3,\" \"))","v":" "},null,{"$f":"RANK(AB27,(AB8:AB15,AB20:AB27),0)","v":1},0,0,0,0,0,0]
[" ","Team Fouls",null,null,null,null,null,null,null,null,null,null,null,null,null,null,null,null,null,null,null,null,null,null,null,null,null,0,null,"f",null,{"$f":"AB29","v":0}]
[null,"Running Total",{"$f":"SUM(C20:C28)","v":0},{"$f":"C29+SUM(D20:D28)","v":0},0,0,0,0,0,0,0,0,0,0,0,0,0,0,0,0,0,0,0,0,0,0,0,{"$f":"SUM(AB20:AB28)","v":0},null,{"$f":"SUM(AD20:AD28)","v":0},{"$f":"SUM(AE20:AE28)","v":0},null,null,null,{"$f":"SUM(AI20:AI27)","v":0},0,0,0,0,0]
[]
[null," ","   No Scores",null,null,null,null,null,null,null,null,null,"1st Place Team : ",null,null,null,{"$f":"IF(AD17>=AD29,B7,B19)","v":"Red Team"},null,null,null,null,null,"Score : ",null,{"$f":"MAXA(AB17,AB29)","v":0},"Score Difference:",null,null,null,null,null,{"$f":"IF(AB17>AB29,AB17-AB29,AB29-AB17)","v":0},null," ",null,null,null,null,"Not Clear"]
[null,null,null,null,null,null,null,null,null,null,null,null,"2nd Place Team : ",null,null,null,{"$f":"IF(AD17>=AD29,B19,B7)","v":"Green Team"},null,null,null,null,null,"Score : ",null,{"$f":"MINA(AB17,AB29)","v":0}]
[null,null,null,null,null,null,null,null,null,null,null,null,null,null,null,null,null,null,null,null,null,"Difference : ",null,null,{"$f":"Y31-Y32","v":0}]
[]
[]
[]
[null,null,null,null,null,null,null,null,null,null,null,null,"Timer Start",null,null,null,"00:07:30",null,null,null,"Foul Time",null,null,"Foul#","Q#","Foul",null,"User"]
[null,null,null,null,null,null,null,null,null,null,null,null,"Timer Now"]
[null,null,null,null,null,null,null,null,null,null,null,null,"Timer End  ",null,null,null," "]
[null,null,null,null,null,null,null,null,null,null,null,null,"Timer Stop ",null,null,null,"00:07:32"]
[null,null,null,null,null,null,null,null,null,null,null,null,null,null,null,null,"21:32:42"]

{"sheet":"R_9","index":8,"n_rows":41,"n_cols":51,"rows_kept":41,"cut":false,"hidden":false,"merged":[[1,4,1,5],[1,33,1,34],[2,33,2,34],[3,33,3,34],[4,25,5,26],[4,27,4,29],[4,30,4,32],[4,34,4,36],[6,8,6,10],[6,14,6,15],[6,16,6,19],[6,31,6,32],[0,6,1,7],[0,33,0,34],[18,8,18,10],[18,14,18,15],[18,16,18,19],[18,31,18,32],[7,31,7,32],[8,31,8,32],[9,31,9,32],[10,31,10,32],[11,31,11,32],[12,31,12,32],[19,31,19,32],[20,31,20,32],[21,31,21,32],[22,31,22,32],[23,31,23,32],[24,31,24,32],[13,31,13,32],[14,31,14,32],[15,31,16,32],[25,31,25,32],[26,31,26,32],[27,31,28,32],[30,2,30,7],[30,8,30,9],[30,12,30,15],[30,16,30,21],[30,22,30,23],[30,25,31,30],[30,31,31,32],[32,2,32,7],[32,8,32,9],[32,21,32,23],[33,2,33,7],[33,8,33,9],[34,2,34,7],[34,8,34,9],[30,38,30,40],[31,2,31,7],[31,8,31,9],[31,12,31,15],[31,16,31,21],[31,22,31,23],[35,2,35,7],[35,8,35,9],[35,16,35,18],[35,20,35,25],[36,2,36,7],[36,8,36,9],[36,12,36,15],[36,16,36,18],[36,20,36,22],[37,2,37,7],[37,8,37,9],[37,12,37,15],[37,16,37,18],[37,20,37,22],[38,2,38,7],[38,8,38,9],[38,12,38,15],[38,16,38,18],[38,20,38,22],[41,2,41,7],[41,8,41,9],[41,16,41,18],[41,20,41,22],[42,2,42,7],[42,8,42,9],[42,16,42,18],[42,20,42,22],[39,2,39,7],[39,8,39,9],[39,12,39,15],[39,16,39,18],[39,20,39,22],[40,2,40,7],[40,8,40,9],[40,16,40,18],[40,20,40,22],[45,2,45,7],[45,8,45,9],[45,16,45,18],[45,20,45,22],[43,2,43,7],[43,8,43,9],[43,16,43,18],[43,20,43,22],[44,2,44,7],[44,8,44,9],[44,16,44,18],[44,20,44,22]]}
[null,"JBQ Round",9,null,null,null,0,null,30,null,null,null,null,null,null,null,null,null,null,null,null,null,null,null,null,null,null,null,null,null,null,null,null,"Coach Help",null,"10's","20's","30's","Points","Negs","Red",null,"SetC",null,null,null,null,null,null,"Cleared"]
[null,"JBQ Room",null,null,"Stop",null,null,null,null,null,null,null,null,null,null,null,null,null,null,null,null,null,null,null,null,null,null,null,null,null,null,null,null,"Asked",null,{"$f":"COUNTIF($C6:$Y6,10)","v":0},{"$f":"COUNTIF($C6:$Y6,20)","v":0},{"$f":"COUNTIF($C6:$Y6,30)","v":0},{"$f":"(AJ2*10)+(AK2*20)+(AL2*30)","v":0},{"$f":"(AJ2*-5)+(AK2*-10)+(AL2*-15)","v":0},null,null,null,null,null,null,null,null,null,null,"Sounds\\tada.wav"]
[null,"JBQ Division",null,null,null,null,null,null,null,null,null,null,null,null,null,null,null,null,null,null,null,null,null,null,null,null,null,null,null,null,null,null,null,"Max",null,10,7,3,{"$f":"(AJ3*10)+(AK3*20)+(AL3*30)","v":330},{"$f":"(AJ3*-5)+(AK3*-10)+(AL3*-15)","v":-165},0,null,null,null,null,null,null,null,null,"Wave Play"]
[null,"Interrupt",null,null,null,null,null,null,null,null,null,null,null,null,null,null,null,null,null,null,null,null,null,null,null,null,null,null,null,null,null,null,null,"Remaining",null,{"$f":"AJ3-AJ2","v":10},{"$f":"AK3-AK2","v":7},{"$f":"AL3-AL2","v":3},{"$f":"(AJ4*10)+(AK4*20)+(AL4*30)","v":330},{"$f":"(AJ4*-5)+(AK4*-10)+(AL4*-15)","v":-165},0,null,null,null,null,null,null,null,null,"Sounds\\tada.wav"]
[0,"Question Number",1,{"$f":"C5+1","v":2},{"$f":"D5+1","v":3},4,5,6,7,8,9,10,11,12,13,14,15,16,17,18,19,20,"ot1","ot2","ot3",0,null,"Time Start",null,null,"00:07:30",null,null,"Now","00:07:33",null,null,null,null,null,null,null,null,null,null,null,null,null,null,"Wave No File"]
[null,"Point Value ",null,null,null,null,null,null,null,null,null,null,null,null,null,null,null,null,null,null,null,null,null,null,null,null,null,null,null,"Cnt","Cnt",null,null,null,"Cnt","Cnt","Cnt","Cnt","Cnt","Cnt",null,null,null,null,null,null,null,null,null,"C:\\AA\\CedarPark\\JBQ1\\Sounds\\tada.wav"]
[null,"Red Team",null,null,null,null,null,null,"Time-Outs  ",null,null,1,2,3,null,null,"Coach Appeals",null,null,null,1,2,null,null,null,"Fouls","Bonus","Total",null,"Oks","Not","Outs",null,"Rank","10's","20's","30's","-5's","-10's","-15's",null,null,"Neg",null,null,null,null,null,null,"Wave Playing"]
[1,"Quiz-1",null,null,null,null,null,null,null,null,null,null,null,null,null,null,null,null,null,null,null,null,null,null,null,null,{"$f":"IF(AD8>5,10,\"\")","v":""},{"$f":"SUM(C8:AA8)","v":0},null,{"$f":"COUNTIF(C8:Y8,10)+COUNTIF(C8:Y8,20)+COUNTIF(C8:Y8,30)","v":0},{"$f":"COUNTIF(C8:Y8,-5)+COUNTIF(C8:Y8,-10)+COUNTIF(C8:Y8,-15)","v":0},{"$f":"IF(AD8>Data!$J$4,Data!$J$3,IF(AE8>Data!$K$4,Data!$K$3,\" \"))","v":" "},null,{"$f":"RANK(AB8,(AB8:AB15,AB20:AB27),0)","v":1},{"$f":"COUNTIF(C8:Y8,10)","v":0},{"$f":"COUNTIF(C8:Y8,20)","v":0},{"$f":"COUNTIF(C8:Y8,30)","v":0},{"$f":"COUNTIF(C8:Y8,-5)","v":0},{"$f":"COUNTIF(C8:Y8,-10)","v":0},{"$f":"COUNTIF(C8:Y8,-15)","v":0},null,null,"Plus",5,null,null,null,null,null,"Wave Waiting"]
[null,null,null,null,null,null,null,null,null,null,null,null,null,null,null,null,null,null,null,null,null,null,null,null,null,null,{"$f":"IF(AD9>5,10,\"\")","v":""},{"$f":"SUM(C9:AA9)","v":0},null,{"$f":"COUNTIF(C9:Y9,10)+COUNTIF(C9:Y9,20)+COUNTIF(C9:Y9,30)","v":0},{"$f":"COUNTIF(C9:Y9,-5)+COUNTIF(C9:Y9,-10)+COUNTIF(C9:Y9,-15)","v":0},{"$f":"IF(AD9>Data!$J$4,Data!$J$3,IF(AE9>Data!$K$4,Data!$K$3,\" \"))","v":" "},null,{"$f":"RANK(AB9,(AB8:AB15,AB20:AB27),0)","v":1},{"$f":"COUNTIF(C9:Y9,10)","v":0},{"$f":"COUNTIF(C9:Y9,20)","v":0},{"$f":"COUNTIF(C9:Y9,30)","v":0},{"$f":"COUNTIF(C9:Y9,-5)","v":0},{"$f":"COUNTIF(C9:Y9,-10)","v":0},{"$f":"COUNTIF(C9:Y9,-15)","v":0},null,null,"Quiz-Out",4,null,null,null,null,null,"Wave Ending"]
[2,"Quiz-2",null,null,null,null,null,null,null,null,null,null,null,null,null,null,null,null,null,null,null,null,null,null,null,null,"",{"$f":"SUM(C10:AA10)","v":0},null,0,0,{"$f":"IF(AD10>Data!$J$4,Data!$J$3,IF(AE10>Data!$K$4,Data!$K$3,\" \"))","v":" "},null,{"$f":"RANK(AB10,(AB8:AB15,AB20:AB27),0)","v":1},0,0,0,0,0,0,null,null,"Minus",1]
[" ",null,null,null,null,null,null,null,null,null,null,null,null,null,null,null,null,null,null,null,null,null,null,null,null,null,"",{"$f":"SUM(C11:AA11)","v":0},null,0,0,{"$f":"IF(AD11>Data!$J$4,Data!$J$3,IF(AE11>Data!$K$4,Data!$K$3,\" \"))","v":" "},null,{"$f":"RANK(AB11,(AB8:AB15,AB20:AB27),0)","v":1},0,0,0,0,0,0,null,null,"Fizz-Out",2]
[3,"Quiz-3",null,null,null,null,null,null,null,null,null,null,null,null,null,null,null,null,null,null,null,null,null,null,null,null,"",0,null,0,0,{"$f":"IF(AD12>Data!$J$4,Data!$J$3,IF(AE12>Data!$K$4,Data!$K$3,\" \"))","v":" "},null,{"$f":"RANK(AB12,(AB8:AB15,AB20:AB27),0)","v":1},0,0,0,0,0,0,null,null,"Time-Start"]
[" ",null,null,null,null,null,null,null,null,null,null,null,null,null,null,null,null,null,null,null,null,null,null,null,null,null,"",0,null,0,0,{"$f":"IF(AD13>Data!$J$4,Data!$J$3,IF(AE13>Data!$K$4,Data!$K$3,\" \"))","v":" "},null,{"$f":"RANK(AB13,(AB8:AB15,AB20:AB27),0)","v":1},0,0,0,0,0,0,null,null,"Time-Stop"]
[4,"Quiz-4",null,null,null,null,null,null,null,null,null,null,null,null,null,null,null,null,null,null,null,null,null,null,null,null,"",0,null,0,0,{"$f":"IF(AD14>Data!$J$4,Data!$J$3,IF(AE14>Data!$K$4,Data!$K$3,\" \"))","v":" "},null,{"$f":"RANK(AB14,(AB8:AB15,AB20:AB27),0)","v":1},0,0,0,0,0,0,null,null,"Time-End"]
[" ",null,null,null,null,null,null,null,null,null,null,null,null,null,null,null,null,null,null,null,null,null,null,null,null,null,"",0,null,0,0,{"$f":"IF(AD15>Data!$J$4,Data!$J$3,IF(AE15>Data!$K$4,Data!$K$3,\" \"))","v":" "},null,{"$f":"RANK(AB15,(AB8:AB15,AB20:AB27),0)","v":1},0,0,0,0,0,0,null,null,"Sound-On",null,null,null,null,null,null,"21:32:40"]
[" ","Team Fouls",null,null,null,null,null,null,null,null,null,null,null,null,null,null,null,null,null,null,null,null,null,null,null,null,null,0,null,null,null,{"$f":"AB17","v":0}]
[null,"Running Total",{"$f":"SUM(C8:C16)","v":0},{"$f":"C17+SUM(D8:D16)","v":0},0,0,0,0,0,0,0,0,0,{"$f":"M17+SUM(N8:N16)","v":0},0,0,0,0,0,0,0,0,{"$f":"V17+SUM(W8:W16)","v":0},{"$f":"W17+SUM(X8:X16)","v":0},{"$f":"X17+SUM(Y8:Y16)","v":0},{"$f":"X17+SUM(Z8:Z16)","v":0},{"$f":"Z17+SUM(AA8:AA16)","v":0},{"$f":"SUM(AB8:AB16)","v":0},null,{"$f":"SUM(AD8:AD16)","v":0},{"$f":"SUM(AE8:AE16)","v":0},null,null,null,{"$f":"SUM(AI8:AI15)","v":0},0,0,0,0,0]
[]
[null,"Green Team",null,null,null,null,null,null,"Time-Outs  ",null,null,1,2,3,null,null,"Coach Appeals",null,null,null,1,2,null,null,null,"Fouls","Bonus","Total",null,"Oks","Not","Outs"]
[1,"Quizzer-5",null,null,null,null,null,null,null,null,null,null,null,null,null,null,null,null,null,null,null,null,null,null,null,null,{"$f":"IF(AD20>5,10,\"\")","v":""},{"$f":"SUM(C20:AA20)","v":0},null,{"$f":"COUNTIF(C20:Y20,10)+COUNTIF(C20:Y20,20)+COUNTIF(C20:Y20,30)","v":0},{"$f":"COUNTIF(C20:Y20,-5)+COUNTIF(C20:Y20,-10)+COUNTIF(C20:Y20,-15)","v":0},{"$f":"IF(AD20>Data!$J$4,Data!$J$3,IF(AE20>Data!$K$4,Data!$K$3,\" \"))","v":" "},null,{"$f":"RANK(AB20,(AB8:AB15,AB20:AB27),0)","v":1},{"$f":"COUNTIF(C20:Y20,10)","v":0},{"$f":"COUNTIF(C20:Y20,20)","v":0},0,0,0,{"$f":"COUNTIF(C20:Y20,-15)","v":0}]
[null,null,null,null,null,null,null,null,null,null,null,null,null,null,null,null,null,null,null,null,null,null,null,null,null,null,{"$f":"IF(AD21>5,10,\"\")","v":""},0,null,0,0,{"$f":"IF(AD21>Data!$J$4,Data!$J$3,IF(AE21>Data!$K$4,Data!$K$3,\" \"))","v":" "},null,{"$f":"RANK(AB21,(AB8:AB15,AB20:AB27),0)","v":1},0,0,{"$f":"COUNTIF(C21:Y21,30)","v":0},0,0,0]
[2,"Quizzer-6",null,null,null,null,null,null,null,null,null,null,null,null,null,null,null,null,null,null,null,null,null,null,null,null,"",0,null,0,0,{"$f":"IF(AD22>Data!$J$4,Data!$J$3,IF(AE22>Data!$K$4,Data!$K$3,\" \"))","v":" "},null,{"$f":"RANK(AB22,(AB8:AB15,AB20:AB27),0)","v":1},0,0,0,{"$f":"COUNTIF(C22:Y22,-5)","v":0},{"$f":"COUNTIF(C22:Y22,-10)","v":0},0]
[" ",null,null,null,null,null,null,null,null,null,null,null,null,null,null,null,null,null,null,null,null,null,null,null,null,null,"",0,null,0,0,{"$f":"IF(AD23>Data!$J$4,Data!$J$3,IF(AE23>Data!$K$4,Data!$K$3,\" \"))","v":" "},null,{"$f":"RANK(AB23,(AB8:AB15,AB20:AB27),0)","v":1},0,0,0,0,0,0]
[3,"Quizzer-7",null,null,null,null,null,null,null,null,null,null,null,null,null,null,null,null,null,null,null,null,null,null,null,null,"",0,null,0,0,{"$f":"IF(AD24>Data!$J$4,Data!$J$3,IF(AE24>Data!$K$4,Data!$K$3,\" \"))","v":" "},null,{"$f":"RANK(AB24,(AB8:AB15,AB20:AB27),0)","v":1},0,0,0,0,0,0]
[" ",null,null,null,null,null,null,null,null,null,null,null,null,null,null,null,null,null,null,null,null,null,null,null,null,null,"",0,null,0,0,{"$f":"IF(AD25>Data!$J$4,Data!$J$3,IF(AE25>Data!$K$4,Data!$K$3,\" \"))","v":" "},null,{"$f":"RANK(AB25,(AB8:AB15,AB20:AB27),0)","v":1},0,0,0,0,0,0]
[4,"Quizzer-8",null,null,null,null,null,null,null,null,null,null,null,null,null,null,null,null,null,null,null,null,null,null,null,null,"",0,null,0,0,{"$f":"IF(AD26>Data!$J$4,Data!$J$3,IF(AE26>Data!$K$4,Data!$K$3,\" \"))","v":" "},null,{"$f":"RANK(AB26,(AB8:AB15,AB20:AB27),0)","v":1},0,0,0,0,0,0]
[null,null,null,null,null,null,null,null,null,null,null,null,null,null,null,null,null,null,null,null,null,null,null,null,null,null,"",{"$f":"SUM(C27:AA27)","v":0},null,0,0,{"$f":"IF(AD27>Data!$J$4,Data!$J$3,IF(AE27>Data!$K$4,Data!$K$3,\" \"))","v":" "},null,{"$f":"RANK(AB27,(AB8:AB15,AB20:AB27),0)","v":1},0,0,0,0,0,0]
[" ","Team Fouls",null,null,null,null,null,null,null,null,null,null,null,null,null,null,null,null,null,null,null,null,null,null,null,null,null,0,null,"f",null,{"$f":"AB29","v":0}]
[null,"Running Total",{"$f":"SUM(C20:C28)","v":0},{"$f":"C29+SUM(D20:D28)","v":0},0,0,0,0,0,0,0,0,0,0,0,0,0,0,0,0,0,0,0,0,0,0,0,{"$f":"SUM(AB20:AB28)","v":0},null,{"$f":"SUM(AD20:AD28)","v":0},{"$f":"SUM(AE20:AE28)","v":0},null,null,null,{"$f":"SUM(AI20:AI27)","v":0},0,0,0,0,0]
[]
[null," ","   No Scores",null,null,null,null,null,null,null,null,null,"1st Place Team : ",null,null,null,{"$f":"IF(AD17>=AD29,B7,B19)","v":"Red Team"},null,null,null,null,null,"Score : ",null,{"$f":"MAXA(AB17,AB29)","v":0},"Score Difference:",null,null,null,null,null,{"$f":"IF(AB17>AB29,AB17-AB29,AB29-AB17)","v":0},null," ",null,null,null,null,"Not Clear"]
[null,null,null,null,null,null,null,null,null,null,null,null,"2nd Place Team : ",null,null,null,{"$f":"IF(AD17>=AD29,B19,B7)","v":"Green Team"},null,null,null,null,null,"Score : ",null,{"$f":"MINA(AB17,AB29)","v":0}]
[null,null,null,null,null,null,null,null,null,null,null,null,null,null,null,null,null,null,null,null,null,"Difference : ",null,null,{"$f":"Y31-Y32","v":0}]
[]
[]
[]
[null,null,null,null,null,null,null,null,null,null,null,null,"Timer Start",null,null,null,"00:07:30",null,null,null,"Foul Time",null,null,"Foul#","Q#","Foul",null,"User"]
[null,null,null,null,null,null,null,null,null,null,null,null,"Timer Now"]
[null,null,null,null,null,null,null,null,null,null,null,null,"Timer End  ",null,null,null," "]
[null,null,null,null,null,null,null,null,null,null,null,null,"Timer Stop ",null,null,null,"00:07:32"]
[null,null,null,null,null,null,null,null,null,null,null,null,null,null,null,null,"21:32:42"]

{"sheet":"R_10","index":9,"n_rows":41,"n_cols":51,"rows_kept":41,"cut":false,"hidden":false,"merged":[[1,4,1,5],[1,33,1,34],[2,33,2,34],[3,33,3,34],[4,25,5,26],[4,27,4,29],[4,30,4,32],[4,34,4,36],[6,8,6,10],[6,14,6,15],[6,16,6,19],[6,31,6,32],[0,6,1,7],[0,33,0,34],[18,8,18,10],[18,14,18,15],[18,16,18,19],[18,31,18,32],[7,31,7,32],[8,31,8,32],[9,31,9,32],[10,31,10,32],[11,31,11,32],[12,31,12,32],[19,31,19,32],[20,31,20,32],[21,31,21,32],[22,31,22,32],[23,31,23,32],[24,31,24,32],[13,31,13,32],[14,31,14,32],[15,31,16,32],[25,31,25,32],[26,31,26,32],[27,31,28,32],[30,2,30,7],[30,8,30,9],[30,12,30,15],[30,16,30,21],[30,22,30,23],[30,25,31,30],[30,31,31,32],[32,2,32,7],[32,8,32,9],[32,21,32,23],[33,2,33,7],[33,8,33,9],[34,2,34,7],[34,8,34,9],[30,38,30,40],[31,2,31,7],[31,8,31,9],[31,12,31,15],[31,16,31,21],[31,22,31,23],[35,2,35,7],[35,8,35,9],[35,16,35,18],[35,20,35,25],[36,2,36,7],[36,8,36,9],[36,12,36,15],[36,16,36,18],[36,20,36,22],[37,2,37,7],[37,8,37,9],[37,12,37,15],[37,16,37,18],[37,20,37,22],[38,2,38,7],[38,8,38,9],[38,12,38,15],[38,16,38,18],[38,20,38,22],[41,2,41,7],[41,8,41,9],[41,16,41,18],[41,20,41,22],[42,2,42,7],[42,8,42,9],[42,16,42,18],[42,20,42,22],[39,2,39,7],[39,8,39,9],[39,12,39,15],[39,16,39,18],[39,20,39,22],[40,2,40,7],[40,8,40,9],[40,16,40,18],[40,20,40,22],[45,2,45,7],[45,8,45,9],[45,16,45,18],[45,20,45,22],[43,2,43,7],[43,8,43,9],[43,16,43,18],[43,20,43,22],[44,2,44,7],[44,8,44,9],[44,16,44,18],[44,20,44,22]]}
[null,"JBQ Round",10,null,null,null,0,null,30,null,null,null,null,null,null,null,null,null,null,null,null,null,null,null,null,null,null,null,null,null,null,null,null,"Coach Help",null,"10's","20's","30's","Points","Negs","Red",null,"SetC",null,null,null,null,null,null,"Cleared"]
[null,"JBQ Room",null,null,"Stop",null,null,null,null,null,null,null,null,null,null,null,null,null,null,null,null,null,null,null,null,null,null,null,null,null,null,null,null,"Asked",null,{"$f":"COUNTIF($C6:$Y6,10)","v":0},{"$f":"COUNTIF($C6:$Y6,20)","v":0},{"$f":"COUNTIF($C6:$Y6,30)","v":0},{"$f":"(AJ2*10)+(AK2*20)+(AL2*30)","v":0},{"$f":"(AJ2*-5)+(AK2*-10)+(AL2*-15)","v":0},null,null,null,null,null,null,null,null,null,null,"Sounds\\tada.wav"]
[null,"JBQ Division",null,null,null,null,null,null,null,null,null,null,null,null,null,null,null,null,null,null,null,null,null,null,null,null,null,null,null,null,null,null,null,"Max",null,10,7,3,{"$f":"(AJ3*10)+(AK3*20)+(AL3*30)","v":330},{"$f":"(AJ3*-5)+(AK3*-10)+(AL3*-15)","v":-165},0,null,null,null,null,null,null,null,null,"Wave Play"]
[null,"Interrupt",null,null,null,null,null,null,null,null,null,null,null,null,null,null,null,null,null,null,null,null,null,null,null,null,null,null,null,null,null,null,null,"Remaining",null,{"$f":"AJ3-AJ2","v":10},{"$f":"AK3-AK2","v":7},{"$f":"AL3-AL2","v":3},{"$f":"(AJ4*10)+(AK4*20)+(AL4*30)","v":330},{"$f":"(AJ4*-5)+(AK4*-10)+(AL4*-15)","v":-165},0,null,null,null,null,null,null,null,null,"Sounds\\tada.wav"]
[0,"Question Number",1,{"$f":"C5+1","v":2},{"$f":"D5+1","v":3},4,5,6,7,8,9,10,11,12,13,14,15,16,17,18,19,20,"ot1","ot2","ot3",0,null,"Time Start",null,null,"00:07:30",null,null,"Now","00:07:33",null,null,null,null,null,null,null,null,null,null,null,null,null,null,"Wave No File"]
[null,"Point Value ",null,null,null,null,null,null,null,null,null,null,null,null,null,null,null,null,null,null,null,null,null,null,null,null,null,null,null,"Cnt","Cnt",null,null,null,"Cnt","Cnt","Cnt","Cnt","Cnt","Cnt",null,null,null,null,null,null,null,null,null,"C:\\AA\\CedarPark\\JBQ1\\Sounds\\tada.wav"]
[null,"Red Team",null,null,null,null,null,null,"Time-Outs  ",null,null,1,2,3,null,null,"Coach Appeals",null,null,null,1,2,null,null,null,"Fouls","Bonus","Total",null,"Oks","Not","Outs",null,"Rank","10's","20's","30's","-5's","-10's","-15's",null,null,"Neg",null,null,null,null,null,null,"Wave Playing"]
[1,"Quiz-1",null,null,null,null,null,null,null,null,null,null,null,null,null,null,null,null,null,null,null,null,null,null,null,null,{"$f":"IF(AD8>5,10,\"\")","v":""},{"$f":"SUM(C8:AA8)","v":0},null,{"$f":"COUNTIF(C8:Y8,10)+COUNTIF(C8:Y8,20)+COUNTIF(C8:Y8,30)","v":0},{"$f":"COUNTIF(C8:Y8,-5)+COUNTIF(C8:Y8,-10)+COUNTIF(C8:Y8,-15)","v":0},{"$f":"IF(AD8>Data!$J$4,Data!$J$3,IF(AE8>Data!$K$4,Data!$K$3,\" \"))","v":" "},null,{"$f":"RANK(AB8,(AB8:AB15,AB20:AB27),0)","v":1},{"$f":"COUNTIF(C8:Y8,10)","v":0},{"$f":"COUNTIF(C8:Y8,20)","v":0},{"$f":"COUNTIF(C8:Y8,30)","v":0},{"$f":"COUNTIF(C8:Y8,-5)","v":0},{"$f":"COUNTIF(C8:Y8,-10)","v":0},{"$f":"COUNTIF(C8:Y8,-15)","v":0},null,null,"Plus",5,null,null,null,null,null,"Wave Waiting"]
[null,null,null,null,null,null,null,null,null,null,null,null,null,null,null,null,null,null,null,null,null,null,null,null,null,null,{"$f":"IF(AD9>5,10,\"\")","v":""},{"$f":"SUM(C9:AA9)","v":0},null,{"$f":"COUNTIF(C9:Y9,10)+COUNTIF(C9:Y9,20)+COUNTIF(C9:Y9,30)","v":0},{"$f":"COUNTIF(C9:Y9,-5)+COUNTIF(C9:Y9,-10)+COUNTIF(C9:Y9,-15)","v":0},{"$f":"IF(AD9>Data!$J$4,Data!$J$3,IF(AE9>Data!$K$4,Data!$K$3,\" \"))","v":" "},null,{"$f":"RANK(AB9,(AB8:AB15,AB20:AB27),0)","v":1},{"$f":"COUNTIF(C9:Y9,10)","v":0},{"$f":"COUNTIF(C9:Y9,20)","v":0},{"$f":"COUNTIF(C9:Y9,30)","v":0},{"$f":"COUNTIF(C9:Y9,-5)","v":0},{"$f":"COUNTIF(C9:Y9,-10)","v":0},{"$f":"COUNTIF(C9:Y9,-15)","v":0},null,null,"Quiz-Out",4,null,null,null,null,null,"Wave Ending"]
[2,"Quiz-2",null,null,null,null,null,null,null,null,null,null,null,null,null,null,null,null,null,null,null,null,null,null,null,null,"",{"$f":"SUM(C10:AA10)","v":0},null,0,0,{"$f":"IF(AD10>Data!$J$4,Data!$J$3,IF(AE10>Data!$K$4,Data!$K$3,\" \"))","v":" "},null,{"$f":"RANK(AB10,(AB8:AB15,AB20:AB27),0)","v":1},0,0,0,0,0,0,null,null,"Minus",1]
[" ",null,null,null,null,null,null,null,null,null,null,null,null,null,null,null,null,null,null,null,null,null,null,null,null,null,"",{"$f":"SUM(C11:AA11)","v":0},null,0,0,{"$f":"IF(AD11>Data!$J$4,Data!$J$3,IF(AE11>Data!$K$4,Data!$K$3,\" \"))","v":" "},null,{"$f":"RANK(AB11,(AB8:AB15,AB20:AB27),0)","v":1},0,0,0,0,0,0,null,null,"Fizz-Out",2]
[3,"Quiz-3",null,null,null,null,null,null,null,null,null,null,null,null,null,null,null,null,null,null,null,null,null,null,null,null,"",0,null,0,0,{"$f":"IF(AD12>Data!$J$4,Data!$J$3,IF(AE12>Data!$K$4,Data!$K$3,\" \"))","v":" "},null,{"$f":"RANK(AB12,(AB8:AB15,AB20:AB27),0)","v":1},0,0,0,0,0,0,null,null,"Time-Start"]
[" ",null,null,null,null,null,null,null,null,null,null,null,null,null,null,null,null,null,null,null,null,null,null,null,null,null,"",0,null,0,0,{"$f":"IF(AD13>Data!$J$4,Data!$J$3,IF(AE13>Data!$K$4,Data!$K$3,\" \"))","v":" "},null,{"$f":"RANK(AB13,(AB8:AB15,AB20:AB27),0)","v":1},0,0,0,0,0,0,null,null,"Time-Stop"]
[4,"Quiz-4",null,null,null,null,null,null,null,null,null,null,null,null,null,null,null,null,null,null,null,null,null,null,null,null,"",0,null,0,0,{"$f":"IF(AD14>Data!$J$4,Data!$J$3,IF(AE14>Data!$K$4,Data!$K$3,\" \"))","v":" "},null,{"$f":"RANK(AB14,(AB8:AB15,AB20:AB27),0)","v":1},0,0,0,0,0,0,null,null,"Time-End"]
[" ",null,null,null,null,null,null,null,null,null,null,null,null,null,null,null,null,null,null,null,null,null,null,null,null,null,"",0,null,0,0,{"$f":"IF(AD15>Data!$J$4,Data!$J$3,IF(AE15>Data!$K$4,Data!$K$3,\" \"))","v":" "},null,{"$f":"RANK(AB15,(AB8:AB15,AB20:AB27),0)","v":1},0,0,0,0,0,0,null,null,"Sound-On",null,null,null,null,null,null,"21:32:40"]
[" ","Team Fouls",null,null,null,null,null,null,null,null,null,null,null,null,null,null,null,null,null,null,null,null,null,null,null,null,null,0,null,null,null,{"$f":"AB17","v":0}]
[null,"Running Total",{"$f":"SUM(C8:C16)","v":0},{"$f":"C17+SUM(D8:D16)","v":0},0,0,0,0,0,0,0,0,0,{"$f":"M17+SUM(N8:N16)","v":0},0,0,0,0,0,0,0,0,{"$f":"V17+SUM(W8:W16)","v":0},{"$f":"W17+SUM(X8:X16)","v":0},{"$f":"X17+SUM(Y8:Y16)","v":0},{"$f":"X17+SUM(Z8:Z16)","v":0},{"$f":"Z17+SUM(AA8:AA16)","v":0},{"$f":"SUM(AB8:AB16)","v":0},null,{"$f":"SUM(AD8:AD16)","v":0},{"$f":"SUM(AE8:AE16)","v":0},null,null,null,{"$f":"SUM(AI8:AI15)","v":0},0,0,0,0,0]
[]
[null,"Green Team",null,null,null,null,null,null,"Time-Outs  ",null,null,1,2,3,null,null,"Coach Appeals",null,null,null,1,2,null,null,null,"Fouls","Bonus","Total",null,"Oks","Not","Outs"]
[1,"Quizzer-5",null,null,null,null,null,null,null,null,null,null,null,null,null,null,null,null,null,null,null,null,null,null,null,null,{"$f":"IF(AD20>5,10,\"\")","v":""},{"$f":"SUM(C20:AA20)","v":0},null,{"$f":"COUNTIF(C20:Y20,10)+COUNTIF(C20:Y20,20)+COUNTIF(C20:Y20,30)","v":0},{"$f":"COUNTIF(C20:Y20,-5)+COUNTIF(C20:Y20,-10)+COUNTIF(C20:Y20,-15)","v":0},{"$f":"IF(AD20>Data!$J$4,Data!$J$3,IF(AE20>Data!$K$4,Data!$K$3,\" \"))","v":" "},null,{"$f":"RANK(AB20,(AB8:AB15,AB20:AB27),0)","v":1},{"$f":"COUNTIF(C20:Y20,10)","v":0},{"$f":"COUNTIF(C20:Y20,20)","v":0},0,0,0,{"$f":"COUNTIF(C20:Y20,-15)","v":0}]
[null,null,null,null,null,null,null,null,null,null,null,null,null,null,null,null,null,null,null,null,null,null,null,null,null,null,{"$f":"IF(AD21>5,10,\"\")","v":""},0,null,0,0,{"$f":"IF(AD21>Data!$J$4,Data!$J$3,IF(AE21>Data!$K$4,Data!$K$3,\" \"))","v":" "},null,{"$f":"RANK(AB21,(AB8:AB15,AB20:AB27),0)","v":1},0,0,{"$f":"COUNTIF(C21:Y21,30)","v":0},0,0,0]
[2,"Quizzer-6",null,null,null,null,null,null,null,null,null,null,null,null,null,null,null,null,null,null,null,null,null,null,null,null,"",0,null,0,0,{"$f":"IF(AD22>Data!$J$4,Data!$J$3,IF(AE22>Data!$K$4,Data!$K$3,\" \"))","v":" "},null,{"$f":"RANK(AB22,(AB8:AB15,AB20:AB27),0)","v":1},0,0,0,{"$f":"COUNTIF(C22:Y22,-5)","v":0},{"$f":"COUNTIF(C22:Y22,-10)","v":0},0]
[" ",null,null,null,null,null,null,null,null,null,null,null,null,null,null,null,null,null,null,null,null,null,null,null,null,null,"",0,null,0,0,{"$f":"IF(AD23>Data!$J$4,Data!$J$3,IF(AE23>Data!$K$4,Data!$K$3,\" \"))","v":" "},null,{"$f":"RANK(AB23,(AB8:AB15,AB20:AB27),0)","v":1},0,0,0,0,0,0]
[3,"Quizzer-7",null,null,null,null,null,null,null,null,null,null,null,null,null,null,null,null,null,null,null,null,null,null,null,null,"",0,null,0,0,{"$f":"IF(AD24>Data!$J$4,Data!$J$3,IF(AE24>Data!$K$4,Data!$K$3,\" \"))","v":" "},null,{"$f":"RANK(AB24,(AB8:AB15,AB20:AB27),0)","v":1},0,0,0,0,0,0]
[" ",null,null,null,null,null,null,null,null,null,null,null,null,null,null,null,null,null,null,null,null,null,null,null,null,null,"",0,null,0,0,{"$f":"IF(AD25>Data!$J$4,Data!$J$3,IF(AE25>Data!$K$4,Data!$K$3,\" \"))","v":" "},null,{"$f":"RANK(AB25,(AB8:AB15,AB20:AB27),0)","v":1},0,0,0,0,0,0]
[4,"Quizzer-8",null,null,null,null,null,null,null,null,null,null,null,null,null,null,null,null,null,null,null,null,null,null,null,null,"",0,null,0,0,{"$f":"IF(AD26>Data!$J$4,Data!$J$3,IF(AE26>Data!$K$4,Data!$K$3,\" \"))","v":" "},null,{"$f":"RANK(AB26,(AB8:AB15,AB20:AB27),0)","v":1},0,0,0,0,0,0]
[null,null,null,null,null,null,null,null,null,null,null,null,null,null,null,null,null,null,null,null,null,null,null,null,null,null,"",{"$f":"SUM(C27:AA27)","v":0},null,0,0,{"$f":"IF(AD27>Data!$J$4,Data!$J$3,IF(AE27>Data!$K$4,Data!$K$3,\" \"))","v":" "},null,{"$f":"RANK(AB27,(AB8:AB15,AB20:AB27),0)","v":1},0,0,0,0,0,0]
[" ","Team Fouls",null,null,null,null,null,null,null,null,null,null,null,null,null,null,null,null,null,null,null,null,null,null,null,null,null,0,null,"f",null,{"$f":"AB29","v":0}]
[null,"Running Total",{"$f":"SUM(C20:C28)","v":0},{"$f":"C29+SUM(D20:D28)","v":0},0,0,0,0,0,0,0,0,0,0,0,0,0,0,0,0,0,0,0,0,0,0,0,{"$f":"SUM(AB20:AB28)","v":0},null,{"$f":"SUM(AD20:AD28)","v":0},{"$f":"SUM(AE20:AE28)","v":0},null,null,null,{"$f":"SUM(AI20:AI27)","v":0},0,0,0,0,0]
[]
[null," ","   No Scores",null,null,null,null,null,null,null,null,null,"1st Place Team : ",null,null,null,{"$f":"IF(AD17>=AD29,B7,B19)","v":"Red Team"},null,null,null,null,null,"Score : ",null,{"$f":"MAXA(AB17,AB29)","v":0},"Score Difference:",null,null,null,null,null,{"$f":"IF(AB17>AB29,AB17-AB29,AB29-AB17)","v":0},null," ",null,null,null,null,"Not Clear"]
[null,null,null,null,null,null,null,null,null,null,null,null,"2nd Place Team : ",null,null,null,{"$f":"IF(AD17>=AD29,B19,B7)","v":"Green Team"},null,null,null,null,null,"Score : ",null,{"$f":"MINA(AB17,AB29)","v":0}]
[null,null,null,null,null,null,null,null,null,null,null,null,null,null,null,null,null,null,null,null,null,"Difference : ",null,null,{"$f":"Y31-Y32","v":0}]
[]
[]
[]
[null,null,null,null,null,null,null,null,null,null,null,null,"Timer Start",null,null,null,"00:07:30",null,null,null,"Foul Time",null,null,"Foul#","Q#","Foul",null,"User"]
[null,null,null,null,null,null,null,null,null,null,null,null,"Timer Now"]
[null,null,null,null,null,null,null,null,null,null,null,null,"Timer End  ",null,null,null," "]
[null,null,null,null,null,null,null,null,null,null,null,null,"Timer Stop ",null,null,null,"00:07:32"]
[null,null,null,null,null,null,null,null,null,null,null,null,null,null,null,null,"21:32:42"]

{"sheet":"R_11","index":10,"n_rows":41,"n_cols":51,"rows_kept":41,"cut":false,"hidden":false,"merged":[[1,4,1,5],[1,33,1,34],[2,33,2,34],[3,33,3,34],[4,25,5,26],[4,27,4,29],[4,30,4,32],[4,34,4,36],[6,8,6,10],[6,14,6,15],[6,16,6,19],[6,31,6,32],[0,6,1,7],[0,33,0,34],[18,8,18,10],[18,14,18,15],[18,16,18,19],[18,31,18,32],[7,31,7,32],[8,31,8,32],[9,31,9,32],[10,31,10,32],[11,31,11,32],[12,31,12,32],[19,31,19,32],[20,31,20,32],[21,31,21,32],[22,31,22,32],[23,31,23,32],[24,31,24,32],[13,31,13,32],[14,31,14,32],[15,31,16,32],[25,31,25,32],[26,31,26,32],[27,31,28,32],[30,2,30,7],[30,8,30,9],[30,12,30,15],[30,16,30,21],[30,22,30,23],[30,25,31,30],[30,31,31,32],[32,2,32,7],[32,8,32,9],[32,21,32,23],[33,2,33,7],[33,8,33,9],[34,2,34,7],[34,8,34,9],[30,38,30,40],[31,2,31,7],[31,8,31,9],[31,12,31,15],[31,16,31,21],[31,22,31,23],[35,2,35,7],[35,8,35,9],[35,16,35,18],[35,20,35,25],[36,2,36,7],[36,8,36,9],[36,12,36,15],[36,16,36,18],[36,20,36,22],[37,2,37,7],[37,8,37,9],[37,12,37,15],[37,16,37,18],[37,20,37,22],[38,2,38,7],[38,8,38,9],[38,12,38,15],[38,16,38,18],[38,20,38,22],[41,2,41,7],[41,8,41,9],[41,16,41,18],[41,20,41,22],[42,2,42,7],[42,8,42,9],[42,16,42,18],[42,20,42,22],[39,2,39,7],[39,8,39,9],[39,12,39,15],[39,16,39,18],[39,20,39,22],[40,2,40,7],[40,8,40,9],[40,16,40,18],[40,20,40,22],[45,2,45,7],[45,8,45,9],[45,16,45,18],[45,20,45,22],[43,2,43,7],[43,8,43,9],[43,16,43,18],[43,20,43,22],[44,2,44,7],[44,8,44,9],[44,16,44,18],[44,20,44,22]]}
[null,"JBQ Round",11,null,null,null,0,null,30,null,null,null,null,null,null,null,null,null,null,null,null,null,null,null,null,null,null,null,null,null,null,null,null,"Coach Help",null,"10's","20's","30's","Points","Negs","Red",null,"SetC",null,null,null,null,null,null,"Cleared"]
[null,"JBQ Room",null,null,"Stop",null,null,null,null,null,null,null,null,null,null,null,null,null,null,null,null,null,null,null,null,null,null,null,null,null,null,null,null,"Asked",null,{"$f":"COUNTIF($C6:$Y6,10)","v":0},{"$f":"COUNTIF($C6:$Y6,20)","v":0},{"$f":"COUNTIF($C6:$Y6,30)","v":0},{"$f":"(AJ2*10)+(AK2*20)+(AL2*30)","v":0},{"$f":"(AJ2*-5)+(AK2*-10)+(AL2*-15)","v":0},null,null,null,null,null,null,null,null,null,null,"Sounds\\tada.wav"]
[null,"JBQ Division",null,null,null,null,null,null,null,null,null,null,null,null,null,null,null,null,null,null,null,null,null,null,null,null,null,null,null,null,null,null,null,"Max",null,10,7,3,{"$f":"(AJ3*10)+(AK3*20)+(AL3*30)","v":330},{"$f":"(AJ3*-5)+(AK3*-10)+(AL3*-15)","v":-165},0,null,null,null,null,null,null,null,null,"Wave Play"]
[null,"Interrupt",null,null,null,null,null,null,null,null,null,null,null,null,null,null,null,null,null,null,null,null,null,null,null,null,null,null,null,null,null,null,null,"Remaining",null,{"$f":"AJ3-AJ2","v":10},{"$f":"AK3-AK2","v":7},{"$f":"AL3-AL2","v":3},{"$f":"(AJ4*10)+(AK4*20)+(AL4*30)","v":330},{"$f":"(AJ4*-5)+(AK4*-10)+(AL4*-15)","v":-165},0,null,null,null,null,null,null,null,null,"Sounds\\tada.wav"]
[0,"Question Number",1,{"$f":"C5+1","v":2},{"$f":"D5+1","v":3},4,5,6,7,8,9,10,11,12,13,14,15,16,17,18,19,20,"ot1","ot2","ot3",0,null,"Time Start",null,null,"00:07:30",null,null,"Now","00:07:33",null,null,null,null,null,null,null,null,null,null,null,null,null,null,"Wave No File"]
[null,"Point Value ",null,null,null,null,null,null,null,null,null,null,null,null,null,null,null,null,null,null,null,null,null,null,null,null,null,null,null,"Cnt","Cnt",null,null,null,"Cnt","Cnt","Cnt","Cnt","Cnt","Cnt",null,null,null,null,null,null,null,null,null,"C:\\AA\\CedarPark\\JBQ1\\Sounds\\tada.wav"]
[null,"Red Team",null,null,null,null,null,null,"Time-Outs  ",null,null,1,2,3,null,null,"Coach Appeals",null,null,null,1,2,null,null,null,"Fouls","Bonus","Total",null,"Oks","Not","Outs",null,"Rank","10's","20's","30's","-5's","-10's","-15's",null,null,"Neg",null,null,null,null,null,null,"Wave Playing"]
[1,"Quiz-1",null,null,null,null,null,null,null,null,null,null,null,null,null,null,null,null,null,null,null,null,null,null,null,null,{"$f":"IF(AD8>5,10,\"\")","v":""},{"$f":"SUM(C8:AA8)","v":0},null,{"$f":"COUNTIF(C8:Y8,10)+COUNTIF(C8:Y8,20)+COUNTIF(C8:Y8,30)","v":0},{"$f":"COUNTIF(C8:Y8,-5)+COUNTIF(C8:Y8,-10)+COUNTIF(C8:Y8,-15)","v":0},{"$f":"IF(AD8>Data!$J$4,Data!$J$3,IF(AE8>Data!$K$4,Data!$K$3,\" \"))","v":" "},null,{"$f":"RANK(AB8,(AB8:AB15,AB20:AB27),0)","v":1},{"$f":"COUNTIF(C8:Y8,10)","v":0},{"$f":"COUNTIF(C8:Y8,20)","v":0},{"$f":"COUNTIF(C8:Y8,30)","v":0},{"$f":"COUNTIF(C8:Y8,-5)","v":0},{"$f":"COUNTIF(C8:Y8,-10)","v":0},{"$f":"COUNTIF(C8:Y8,-15)","v":0},null,null,"Plus",5,null,null,null,null,null,"Wave Waiting"]
[null,null,null,null,null,null,null,null,null,null,null,null,null,null,null,null,null,null,null,null,null,null,null,null,null,null,{"$f":"IF(AD9>5,10,\"\")","v":""},{"$f":"SUM(C9:AA9)","v":0},null,{"$f":"COUNTIF(C9:Y9,10)+COUNTIF(C9:Y9,20)+COUNTIF(C9:Y9,30)","v":0},{"$f":"COUNTIF(C9:Y9,-5)+COUNTIF(C9:Y9,-10)+COUNTIF(C9:Y9,-15)","v":0},{"$f":"IF(AD9>Data!$J$4,Data!$J$3,IF(AE9>Data!$K$4,Data!$K$3,\" \"))","v":" "},null,{"$f":"RANK(AB9,(AB8:AB15,AB20:AB27),0)","v":1},{"$f":"COUNTIF(C9:Y9,10)","v":0},{"$f":"COUNTIF(C9:Y9,20)","v":0},{"$f":"COUNTIF(C9:Y9,30)","v":0},{"$f":"COUNTIF(C9:Y9,-5)","v":0},{"$f":"COUNTIF(C9:Y9,-10)","v":0},{"$f":"COUNTIF(C9:Y9,-15)","v":0},null,null,"Quiz-Out",4,null,null,null,null,null,"Wave Ending"]
[2,"Quiz-2",null,null,null,null,null,null,null,null,null,null,null,null,null,null,null,null,null,null,null,null,null,null,null,null,"",{"$f":"SUM(C10:AA10)","v":0},null,0,0,{"$f":"IF(AD10>Data!$J$4,Data!$J$3,IF(AE10>Data!$K$4,Data!$K$3,\" \"))","v":" "},null,{"$f":"RANK(AB10,(AB8:AB15,AB20:AB27),0)","v":1},0,0,0,0,0,0,null,null,"Minus",1]
[" ",null,null,null,null,null,null,null,null,null,null,null,null,null,null,null,null,null,null,null,null,null,null,null,null,null,"",{"$f":"SUM(C11:AA11)","v":0},null,0,0,{"$f":"IF(AD11>Data!$J$4,Data!$J$3,IF(AE11>Data!$K$4,Data!$K$3,\" \"))","v":" "},null,{"$f":"RANK(AB11,(AB8:AB15,AB20:AB27),0)","v":1},0,0,0,0,0,0,null,null,"Fizz-Out",2]
[3,"Quiz-3",null,null,null,null,null,null,null,null,null,null,null,null,null,null,null,null,null,null,null,null,null,null,null,null,"",0,null,0,0,{"$f":"IF(AD12>Data!$J$4,Data!$J$3,IF(AE12>Data!$K$4,Data!$K$3,\" \"))","v":" "},null,{"$f":"RANK(AB12,(AB8:AB15,AB20:AB27),0)","v":1},0,0,0,0,0,0,null,null,"Time-Start"]
[" ",null,null,null,null,null,null,null,null,null,null,null,null,null,null,null,null,null,null,null,null,null,null,null,null,null,"",0,null,0,0,{"$f":"IF(AD13>Data!$J$4,Data!$J$3,IF(AE13>Data!$K$4,Data!$K$3,\" \"))","v":" "},null,{"$f":"RANK(AB13,(AB8:AB15,AB20:AB27),0)","v":1},0,0,0,0,0,0,null,null,"Time-Stop"]
[4,"Quiz-4",null,null,null,null,null,null,null,null,null,null,null,null,null,null,null,null,null,null,null,null,null,null,null,null,"",0,null,0,0,{"$f":"IF(AD14>Data!$J$4,Data!$J$3,IF(AE14>Data!$K$4,Data!$K$3,\" \"))","v":" "},null,{"$f":"RANK(AB14,(AB8:AB15,AB20:AB27),0)","v":1},0,0,0,0,0,0,null,null,"Time-End"]
[" ",null,null,null,null,null,null,null,null,null,null,null,null,null,null,null,null,null,null,null,null,null,null,null,null,null,"",0,null,0,0,{"$f":"IF(AD15>Data!$J$4,Data!$J$3,IF(AE15>Data!$K$4,Data!$K$3,\" \"))","v":" "},null,{"$f":"RANK(AB15,(AB8:AB15,AB20:AB27),0)","v":1},0,0,0,0,0,0,null,null,"Sound-On",null,null,null,null,null,null,"21:32:40"]
[" ","Team Fouls",null,null,null,null,null,null,null,null,null,null,null,null,null,null,null,null,null,null,null,null,null,null,null,null,null,0,null,null,null,{"$f":"AB17","v":0}]
[null,"Running Total",{"$f":"SUM(C8:C16)","v":0},{"$f":"C17+SUM(D8:D16)","v":0},0,0,0,0,0,0,0,0,0,{"$f":"M17+SUM(N8:N16)","v":0},0,0,0,0,0,0,0,0,{"$f":"V17+SUM(W8:W16)","v":0},{"$f":"W17+SUM(X8:X16)","v":0},{"$f":"X17+SUM(Y8:Y16)","v":0},{"$f":"X17+SUM(Z8:Z16)","v":0},{"$f":"Z17+SUM(AA8:AA16)","v":0},{"$f":"SUM(AB8:AB16)","v":0},null,{"$f":"SUM(AD8:AD16)","v":0},{"$f":"SUM(AE8:AE16)","v":0},null,null,null,{"$f":"SUM(AI8:AI15)","v":0},0,0,0,0,0]
[]
[null,"Green Team",null,null,null,null,null,null,"Time-Outs  ",null,null,1,2,3,null,null,"Coach Appeals",null,null,null,1,2,null,null,null,"Fouls","Bonus","Total",null,"Oks","Not","Outs"]
[1,"Quizzer-5",null,null,null,null,null,null,null,null,null,null,null,null,null,null,null,null,null,null,null,null,null,null,null,null,{"$f":"IF(AD20>5,10,\"\")","v":""},{"$f":"SUM(C20:AA20)","v":0},null,{"$f":"COUNTIF(C20:Y20,10)+COUNTIF(C20:Y20,20)+COUNTIF(C20:Y20,30)","v":0},{"$f":"COUNTIF(C20:Y20,-5)+COUNTIF(C20:Y20,-10)+COUNTIF(C20:Y20,-15)","v":0},{"$f":"IF(AD20>Data!$J$4,Data!$J$3,IF(AE20>Data!$K$4,Data!$K$3,\" \"))","v":" "},null,{"$f":"RANK(AB20,(AB8:AB15,AB20:AB27),0)","v":1},{"$f":"COUNTIF(C20:Y20,10)","v":0},{"$f":"COUNTIF(C20:Y20,20)","v":0},0,0,0,{"$f":"COUNTIF(C20:Y20,-15)","v":0}]
[null,null,null,null,null,null,null,null,null,null,null,null,null,null,null,null,null,null,null,null,null,null,null,null,null,null,{"$f":"IF(AD21>5,10,\"\")","v":""},0,null,0,0,{"$f":"IF(AD21>Data!$J$4,Data!$J$3,IF(AE21>Data!$K$4,Data!$K$3,\" \"))","v":" "},null,{"$f":"RANK(AB21,(AB8:AB15,AB20:AB27),0)","v":1},0,0,{"$f":"COUNTIF(C21:Y21,30)","v":0},0,0,0]
[2,"Quizzer-6",null,null,null,null,null,null,null,null,null,null,null,null,null,null,null,null,null,null,null,null,null,null,null,null,"",0,null,0,0,{"$f":"IF(AD22>Data!$J$4,Data!$J$3,IF(AE22>Data!$K$4,Data!$K$3,\" \"))","v":" "},null,{"$f":"RANK(AB22,(AB8:AB15,AB20:AB27),0)","v":1},0,0,0,{"$f":"COUNTIF(C22:Y22,-5)","v":0},{"$f":"COUNTIF(C22:Y22,-10)","v":0},0]
[" ",null,null,null,null,null,null,null,null,null,null,null,null,null,null,null,null,null,null,null,null,null,null,null,null,null,"",0,null,0,0,{"$f":"IF(AD23>Data!$J$4,Data!$J$3,IF(AE23>Data!$K$4,Data!$K$3,\" \"))","v":" "},null,{"$f":"RANK(AB23,(AB8:AB15,AB20:AB27),0)","v":1},0,0,0,0,0,0]
[3,"Quizzer-7",null,null,null,null,null,null,null,null,null,null,null,null,null,null,null,null,null,null,null,null,null,null,null,null,"",0,null,0,0,{"$f":"IF(AD24>Data!$J$4,Data!$J$3,IF(AE24>Data!$K$4,Data!$K$3,\" \"))","v":" "},null,{"$f":"RANK(AB24,(AB8:AB15,AB20:AB27),0)","v":1},0,0,0,0,0,0]
[" ",null,null,null,null,null,null,null,null,null,null,null,null,null,null,null,null,null,null,null,null,null,null,null,null,null,"",0,null,0,0,{"$f":"IF(AD25>Data!$J$4,Data!$J$3,IF(AE25>Data!$K$4,Data!$K$3,\" \"))","v":" "},null,{"$f":"RANK(AB25,(AB8:AB15,AB20:AB27),0)","v":1},0,0,0,0,0,0]
[4,"Quizzer-8",null,null,null,null,null,null,null,null,null,null,null,null,null,null,null,null,null,null,null,null,null,null,null,null,"",0,null,0,0,{"$f":"IF(AD26>Data!$J$4,Data!$J$3,IF(AE26>Data!$K$4,Data!$K$3,\" \"))","v":" "},null,{"$f":"RANK(AB26,(AB8:AB15,AB20:AB27),0)","v":1},0,0,0,0,0,0]
[null,null,null,null,null,null,null,null,null,null,null,null,null,null,null,null,null,null,null,null,null,null,null,null,null,null,"",{"$f":"SUM(C27:AA27)","v":0},null,0,0,{"$f":"IF(AD27>Data!$J$4,Data!$J$3,IF(AE27>Data!$K$4,Data!$K$3,\" \"))","v":" "},null,{"$f":"RANK(AB27,(AB8:AB15,AB20:AB27),0)","v":1},0,0,0,0,0,0]
[" ","Team Fouls",null,null,null,null,null,null,null,null,null,null,null,null,null,null,null,null,null,null,null,null,null,null,null,null,null,0,null,"f",null,{"$f":"AB29","v":0}]
[null,"Running Total",{"$f":"SUM(C20:C28)","v":0},{"$f":"C29+SUM(D20:D28)","v":0},0,0,0,0,0,0,0,0,0,0,0,0,0,0,0,0,0,0,0,0,0,0,0,{"$f":"SUM(AB20:AB28)","v":0},null,{"$f":"SUM(AD20:AD28)","v":0},{"$f":"SUM(AE20:AE28)","v":0},null,null,null,{"$f":"SUM(AI20:AI27)","v":0},0,0,0,0,0]
[]
[null," ","   No Scores",null,null,null,null,null,null,null,null,null,"1st Place Team : ",null,null,null,{"$f":"IF(AD17>=AD29,B7,B19)","v":"Red Team"},null,null,null,null,null,"Score : ",null,{"$f":"MAXA(AB17,AB29)","v":0},"Score Difference:",null,null,null,null,null,{"$f":"IF(AB17>AB29,AB17-AB29,AB29-AB17)","v":0},null," ",null,null,null,null,"Not Clear"]
[null,null,null,null,null,null,null,null,null,null,null,null,"2nd Place Team : ",null,null,null,{"$f":"IF(AD17>=AD29,B19,B7)","v":"Green Team"},null,null,null,null,null,"Score : ",null,{"$f":"MINA(AB17,AB29)","v":0}]
[null,null,null,null,null,null,null,null,null,null,null,null,null,null,null,null,null,null,null,null,null,"Difference : ",null,null,{"$f":"Y31-Y32","v":0}]
[]
[]
[]
[null,null,null,null,null,null,null,null,null,null,null,null,"Timer Start",null,null,null,"00:07:30",null,null,null,"Foul Time",null,null,"Foul#","Q#","Foul",null,"User"]
[null,null,null,null,null,null,null,null,null,null,null,null,"Timer Now"]
[null,null,null,null,null,null,null,null,null,null,null,null,"Timer End  ",null,null,null," "]
[null,null,null,null,null,null,null,null,null,null,null,null,"Timer Stop ",null,null,null,"00:07:32"]
[null,null,null,null,null,null,null,null,null,null,null,null,null,null,null,null,"21:32:42"]

{"sheet":"R_12","index":11,"n_rows":41,"n_cols":51,"rows_kept":41,"cut":false,"hidden":false,"merged":[[1,4,1,5],[1,33,1,34],[2,33,2,34],[3,33,3,34],[4,25,5,26],[4,27,4,29],[4,30,4,32],[4,34,4,36],[6,8,6,10],[6,14,6,15],[6,16,6,19],[6,31,6,32],[0,6,1,7],[0,33,0,34],[18,8,18,10],[18,14,18,15],[18,16,18,19],[18,31,18,32],[7,31,7,32],[8,31,8,32],[9,31,9,32],[10,31,10,32],[11,31,11,32],[12,31,12,32],[19,31,19,32],[20,31,20,32],[21,31,21,32],[22,31,22,32],[23,31,23,32],[24,31,24,32],[13,31,13,32],[14,31,14,32],[15,31,16,32],[25,31,25,32],[26,31,26,32],[27,31,28,32],[30,2,30,7],[30,8,30,9],[30,12,30,15],[30,16,30,21],[30,22,30,23],[30,25,31,30],[30,31,31,32],[32,2,32,7],[32,8,32,9],[32,21,32,23],[33,2,33,7],[33,8,33,9],[34,2,34,7],[34,8,34,9],[30,38,30,40],[31,2,31,7],[31,8,31,9],[31,12,31,15],[31,16,31,21],[31,22,31,23],[35,2,35,7],[35,8,35,9],[35,16,35,18],[35,20,35,25],[36,2,36,7],[36,8,36,9],[36,12,36,15],[36,16,36,18],[36,20,36,22],[37,2,37,7],[37,8,37,9],[37,12,37,15],[37,16,37,18],[37,20,37,22],[38,2,38,7],[38,8,38,9],[38,12,38,15],[38,16,38,18],[38,20,38,22],[41,2,41,7],[41,8,41,9],[41,16,41,18],[41,20,41,22],[42,2,42,7],[42,8,42,9],[42,16,42,18],[42,20,42,22],[39,2,39,7],[39,8,39,9],[39,12,39,15],[39,16,39,18],[39,20,39,22],[40,2,40,7],[40,8,40,9],[40,16,40,18],[40,20,40,22],[45,2,45,7],[45,8,45,9],[45,16,45,18],[45,20,45,22],[43,2,43,7],[43,8,43,9],[43,16,43,18],[43,20,43,22],[44,2,44,7],[44,8,44,9],[44,16,44,18],[44,20,44,22]]}
[null,"JBQ Round",12,null,null,null,0,null,30,null,null,null,null,null,null,null,null,null,null,null,null,null,null,null,null,null,null,null,null,null,null,null,null,"Coach Help",null,"10's","20's","30's","Points","Negs","Red",null,"SetC",null,null,null,null,null,null,"Cleared"]
[null,"JBQ Room",null,null,"Stop",null,null,null,null,null,null,null,null,null,null,null,null,null,null,null,null,null,null,null,null,null,null,null,null,null,null,null,null,"Asked",null,{"$f":"COUNTIF($C6:$Y6,10)","v":0},{"$f":"COUNTIF($C6:$Y6,20)","v":0},{"$f":"COUNTIF($C6:$Y6,30)","v":0},{"$f":"(AJ2*10)+(AK2*20)+(AL2*30)","v":0},{"$f":"(AJ2*-5)+(AK2*-10)+(AL2*-15)","v":0},null,null,null,null,null,null,null,null,null,null,"Sounds\\tada.wav"]
[null,"JBQ Division",null,null,null,null,null,null,null,null,null,null,null,null,null,null,null,null,null,null,null,null,null,null,null,null,null,null,null,null,null,null,null,"Max",null,10,7,3,{"$f":"(AJ3*10)+(AK3*20)+(AL3*30)","v":330},{"$f":"(AJ3*-5)+(AK3*-10)+(AL3*-15)","v":-165},0,null,null,null,null,null,null,null,null,"Wave Play"]
[null,"Interrupt",null,null,null,null,null,null,null,null,null,null,null,null,null,null,null,null,null,null,null,null,null,null,null,null,null,null,null,null,null,null,null,"Remaining",null,{"$f":"AJ3-AJ2","v":10},{"$f":"AK3-AK2","v":7},{"$f":"AL3-AL2","v":3},{"$f":"(AJ4*10)+(AK4*20)+(AL4*30)","v":330},{"$f":"(AJ4*-5)+(AK4*-10)+(AL4*-15)","v":-165},0,null,null,null,null,null,null,null,null,"Sounds\\tada.wav"]
[0,"Question Number",1,{"$f":"C5+1","v":2},{"$f":"D5+1","v":3},4,5,6,7,8,9,10,11,12,13,14,15,16,17,18,19,20,"ot1","ot2","ot3",0,null,"Time Start",null,null,"00:07:30",null,null,"Now","00:07:33",null,null,null,null,null,null,null,null,null,null,null,null,null,null,"Wave No File"]
[null,"Point Value ",null,null,null,null,null,null,null,null,null,null,null,null,null,null,null,null,null,null,null,null,null,null,null,null,null,null,null,"Cnt","Cnt",null,null,null,"Cnt","Cnt","Cnt","Cnt","Cnt","Cnt",null,null,null,null,null,null,null,null,null,"C:\\AA\\CedarPark\\JBQ1\\Sounds\\tada.wav"]
[null,"Red Team",null,null,null,null,null,null,"Time-Outs  ",null,null,1,2,3,null,null,"Coach Appeals",null,null,null,1,2,null,null,null,"Fouls","Bonus","Total",null,"Oks","Not","Outs",null,"Rank","10's","20's","30's","-5's","-10's","-15's",null,null,"Neg",null,null,null,null,null,null,"Wave Playing"]
[1,"Quiz-1",null,null,null,null,null,null,null,null,null,null,null,null,null,null,null,null,null,null,null,null,null,null,null,null,{"$f":"IF(AD8>5,10,\"\")","v":""},{"$f":"SUM(C8:AA8)","v":0},null,{"$f":"COUNTIF(C8:Y8,10)+COUNTIF(C8:Y8,20)+COUNTIF(C8:Y8,30)","v":0},{"$f":"COUNTIF(C8:Y8,-5)+COUNTIF(C8:Y8,-10)+COUNTIF(C8:Y8,-15)","v":0},{"$f":"IF(AD8>Data!$J$4,Data!$J$3,IF(AE8>Data!$K$4,Data!$K$3,\" \"))","v":" "},null,{"$f":"RANK(AB8,(AB8:AB15,AB20:AB27),0)","v":1},{"$f":"COUNTIF(C8:Y8,10)","v":0},{"$f":"COUNTIF(C8:Y8,20)","v":0},{"$f":"COUNTIF(C8:Y8,30)","v":0},{"$f":"COUNTIF(C8:Y8,-5)","v":0},{"$f":"COUNTIF(C8:Y8,-10)","v":0},{"$f":"COUNTIF(C8:Y8,-15)","v":0},null,null,"Plus",5,null,null,null,null,null,"Wave Waiting"]
[null,null,null,null,null,null,null,null,null,null,null,null,null,null,null,null,null,null,null,null,null,null,null,null,null,null,{"$f":"IF(AD9>5,10,\"\")","v":""},{"$f":"SUM(C9:AA9)","v":0},null,{"$f":"COUNTIF(C9:Y9,10)+COUNTIF(C9:Y9,20)+COUNTIF(C9:Y9,30)","v":0},{"$f":"COUNTIF(C9:Y9,-5)+COUNTIF(C9:Y9,-10)+COUNTIF(C9:Y9,-15)","v":0},{"$f":"IF(AD9>Data!$J$4,Data!$J$3,IF(AE9>Data!$K$4,Data!$K$3,\" \"))","v":" "},null,{"$f":"RANK(AB9,(AB8:AB15,AB20:AB27),0)","v":1},{"$f":"COUNTIF(C9:Y9,10)","v":0},{"$f":"COUNTIF(C9:Y9,20)","v":0},{"$f":"COUNTIF(C9:Y9,30)","v":0},{"$f":"COUNTIF(C9:Y9,-5)","v":0},{"$f":"COUNTIF(C9:Y9,-10)","v":0},{"$f":"COUNTIF(C9:Y9,-15)","v":0},null,null,"Quiz-Out",4,null,null,null,null,null,"Wave Ending"]
[2,"Quiz-2",null,null,null,null,null,null,null,null,null,null,null,null,null,null,null,null,null,null,null,null,null,null,null,null,"",{"$f":"SUM(C10:AA10)","v":0},null,0,0,{"$f":"IF(AD10>Data!$J$4,Data!$J$3,IF(AE10>Data!$K$4,Data!$K$3,\" \"))","v":" "},null,{"$f":"RANK(AB10,(AB8:AB15,AB20:AB27),0)","v":1},0,0,0,0,0,0,null,null,"Minus",1]
[" ",null,null,null,null,null,null,null,null,null,null,null,null,null,null,null,null,null,null,null,null,null,null,null,null,null,"",{"$f":"SUM(C11:AA11)","v":0},null,0,0,{"$f":"IF(AD11>Data!$J$4,Data!$J$3,IF(AE11>Data!$K$4,Data!$K$3,\" \"))","v":" "},null,{"$f":"RANK(AB11,(AB8:AB15,AB20:AB27),0)","v":1},0,0,0,0,0,0,null,null,"Fizz-Out",2]
[3,"Quiz-3",null,null,null,null,null,null,null,null,null,null,null,null,null,null,null,null,null,null,null,null,null,null,null,null,"",0,null,0,0,{"$f":"IF(AD12>Data!$J$4,Data!$J$3,IF(AE12>Data!$K$4,Data!$K$3,\" \"))","v":" "},null,{"$f":"RANK(AB12,(AB8:AB15,AB20:AB27),0)","v":1},0,0,0,0,0,0,null,null,"Time-Start"]
[" ",null,null,null,null,null,null,null,null,null,null,null,null,null,null,null,null,null,null,null,null,null,null,null,null,null,"",0,null,0,0,{"$f":"IF(AD13>Data!$J$4,Data!$J$3,IF(AE13>Data!$K$4,Data!$K$3,\" \"))","v":" "},null,{"$f":"RANK(AB13,(AB8:AB15,AB20:AB27),0)","v":1},0,0,0,0,0,0,null,null,"Time-Stop"]
[4,"Quiz-4",null,null,null,null,null,null,null,null,null,null,null,null,null,null,null,null,null,null,null,null,null,null,null,null,"",0,null,0,0,{"$f":"IF(AD14>Data!$J$4,Data!$J$3,IF(AE14>Data!$K$4,Data!$K$3,\" \"))","v":" "},null,{"$f":"RANK(AB14,(AB8:AB15,AB20:AB27),0)","v":1},0,0,0,0,0,0,null,null,"Time-End"]
[" ",null,null,null,null,null,null,null,null,null,null,null,null,null,null,null,null,null,null,null,null,null,null,null,null,null,"",0,null,0,0,{"$f":"IF(AD15>Data!$J$4,Data!$J$3,IF(AE15>Data!$K$4,Data!$K$3,\" \"))","v":" "},null,{"$f":"RANK(AB15,(AB8:AB15,AB20:AB27),0)","v":1},0,0,0,0,0,0,null,null,"Sound-On",null,null,null,null,null,null,"21:32:40"]
[" ","Team Fouls",null,null,null,null,null,null,null,null,null,null,null,null,null,null,null,null,null,null,null,null,null,null,null,null,null,0,null,null,null,{"$f":"AB17","v":0}]
[null,"Running Total",{"$f":"SUM(C8:C16)","v":0},{"$f":"C17+SUM(D8:D16)","v":0},0,0,0,0,0,0,0,0,0,{"$f":"M17+SUM(N8:N16)","v":0},0,0,0,0,0,0,0,0,{"$f":"V17+SUM(W8:W16)","v":0},{"$f":"W17+SUM(X8:X16)","v":0},{"$f":"X17+SUM(Y8:Y16)","v":0},{"$f":"X17+SUM(Z8:Z16)","v":0},{"$f":"Z17+SUM(AA8:AA16)","v":0},{"$f":"SUM(AB8:AB16)","v":0},null,{"$f":"SUM(AD8:AD16)","v":0},{"$f":"SUM(AE8:AE16)","v":0},null,null,null,{"$f":"SUM(AI8:AI15)","v":0},0,0,0,0,0]
[]
[null,"Green Team",null,null,null,null,null,null,"Time-Outs  ",null,null,1,2,3,null,null,"Coach Appeals",null,null,null,1,2,null,null,null,"Fouls","Bonus","Total",null,"Oks","Not","Outs"]
[1,"Quizzer-5",null,null,null,null,null,null,null,null,null,null,null,null,null,null,null,null,null,null,null,null,null,null,null,null,{"$f":"IF(AD20>5,10,\"\")","v":""},{"$f":"SUM(C20:AA20)","v":0},null,{"$f":"COUNTIF(C20:Y20,10)+COUNTIF(C20:Y20,20)+COUNTIF(C20:Y20,30)","v":0},{"$f":"COUNTIF(C20:Y20,-5)+COUNTIF(C20:Y20,-10)+COUNTIF(C20:Y20,-15)","v":0},{"$f":"IF(AD20>Data!$J$4,Data!$J$3,IF(AE20>Data!$K$4,Data!$K$3,\" \"))","v":" "},null,{"$f":"RANK(AB20,(AB8:AB15,AB20:AB27),0)","v":1},{"$f":"COUNTIF(C20:Y20,10)","v":0},{"$f":"COUNTIF(C20:Y20,20)","v":0},0,0,0,{"$f":"COUNTIF(C20:Y20,-15)","v":0}]
[null,null,null,null,null,null,null,null,null,null,null,null,null,null,null,null,null,null,null,null,null,null,null,null,null,null,{"$f":"IF(AD21>5,10,\"\")","v":""},0,null,0,0,{"$f":"IF(AD21>Data!$J$4,Data!$J$3,IF(AE21>Data!$K$4,Data!$K$3,\" \"))","v":" "},null,{"$f":"RANK(AB21,(AB8:AB15,AB20:AB27),0)","v":1},0,0,{"$f":"COUNTIF(C21:Y21,30)","v":0},0,0,0]
[2,"Quizzer-6",null,null,null,null,null,null,null,null,null,null,null,null,null,null,null,null,null,null,null,null,null,null,null,null,"",0,null,0,0,{"$f":"IF(AD22>Data!$J$4,Data!$J$3,IF(AE22>Data!$K$4,Data!$K$3,\" \"))","v":" "},null,{"$f":"RANK(AB22,(AB8:AB15,AB20:AB27),0)","v":1},0,0,0,{"$f":"COUNTIF(C22:Y22,-5)","v":0},{"$f":"COUNTIF(C22:Y22,-10)","v":0},0]
[" ",null,null,null,null,null,null,null,null,null,null,null,null,null,null,null,null,null,null,null,null,null,null,null,null,null,"",0,null,0,0,{"$f":"IF(AD23>Data!$J$4,Data!$J$3,IF(AE23>Data!$K$4,Data!$K$3,\" \"))","v":" "},null,{"$f":"RANK(AB23,(AB8:AB15,AB20:AB27),0)","v":1},0,0,0,0,0,0]
[3,"Quizzer-7",null,null,null,null,null,null,null,null,null,null,null,null,null,null,null,null,null,null,null,null,null,null,null,null,"",0,null,0,0,{"$f":"IF(AD24>Data!$J$4,Data!$J$3,IF(AE24>Data!$K$4,Data!$K$3,\" \"))","v":" "},null,{"$f":"RANK(AB24,(AB8:AB15,AB20:AB27),0)","v":1},0,0,0,0,0,0]
[" ",null,null,null,null,null,null,null,null,null,null,null,null,null,null,null,null,null,null,null,null,null,null,null,null,null,"",0,null,0,0,{"$f":"IF(AD25>Data!$J$4,Data!$J$3,IF(AE25>Data!$K$4,Data!$K$3,\" \"))","v":" "},null,{"$f":"RANK(AB25,(AB8:AB15,AB20:AB27),0)","v":1},0,0,0,0,0,0]
[4,"Quizzer-8",null,null,null,null,null,null,null,null,null,null,null,null,null,null,null,null,null,null,null,null,null,null,null,null,"",0,null,0,0,{"$f":"IF(AD26>Data!$J$4,Data!$J$3,IF(AE26>Data!$K$4,Data!$K$3,\" \"))","v":" "},null,{"$f":"RANK(AB26,(AB8:AB15,AB20:AB27),0)","v":1},0,0,0,0,0,0]
[null,null,null,null,null,null,null,null,null,null,null,null,null,null,null,null,null,null,null,null,null,null,null,null,null,null,"",{"$f":"SUM(C27:AA27)","v":0},null,0,0,{"$f":"IF(AD27>Data!$J$4,Data!$J$3,IF(AE27>Data!$K$4,Data!$K$3,\" \"))","v":" "},null,{"$f":"RANK(AB27,(AB8:AB15,AB20:AB27),0)","v":1},0,0,0,0,0,0]
[" ","Team Fouls",null,null,null,null,null,null,null,null,null,null,null,null,null,null,null,null,null,null,null,null,null,null,null,null,null,0,null,"f",null,{"$f":"AB29","v":0}]
[null,"Running Total",{"$f":"SUM(C20:C28)","v":0},{"$f":"C29+SUM(D20:D28)","v":0},0,0,0,0,0,0,0,0,0,0,0,0,0,0,0,0,0,0,0,0,0,0,0,{"$f":"SUM(AB20:AB28)","v":0},null,{"$f":"SUM(AD20:AD28)","v":0},{"$f":"SUM(AE20:AE28)","v":0},null,null,null,{"$f":"SUM(AI20:AI27)","v":0},0,0,0,0,0]
[]
[null," ","   No Scores",null,null,null,null,null,null,null,null,null,"1st Place Team : ",null,null,null,{"$f":"IF(AD17>=AD29,B7,B19)","v":"Red Team"},null,null,null,null,null,"Score : ",null,{"$f":"MAXA(AB17,AB29)","v":0},"Score Difference:",null,null,null,null,null,{"$f":"IF(AB17>AB29,AB17-AB29,AB29-AB17)","v":0},null," ",null,null,null,null,"Not Clear"]
[null,null,null,null,null,null,null,null,null,null,null,null,"2nd Place Team : ",null,null,null,{"$f":"IF(AD17>=AD29,B19,B7)","v":"Green Team"},null,null,null,null,null,"Score : ",null,{"$f":"MINA(AB17,AB29)","v":0}]
[null,null,null,null,null,null,null,null,null,null,null,null,null,null,null,null,null,null,null,null,null,"Difference : ",null,null,{"$f":"Y31-Y32","v":0}]
[]
[]
[]
[null,null,null,null,null,null,null,null,null,null,null,null,"Timer Start",null,null,null,"00:07:30",null,null,null,"Foul Time",null,null,"Foul#","Q#","Foul",null,"User"]
[null,null,null,null,null,null,null,null,null,null,null,null,"Timer Now"]
[null,null,null,null,null,null,null,null,null,null,null,null,"Timer End  ",null,null,null," "]
[null,null,null,null,null,null,null,null,null,null,null,null,"Timer Stop ",null,null,null,"00:07:32"]
[null,null,null,null,null,null,null,null,null,null,null,null,null,null,null,null,"21:32:42"]

{"sheet":"Totals","index":12,"n_rows":40,"n_cols":80,"rows_kept":40,"cut":false,"hidden":false,"merged":[[1,67,1,76],[14,67,14,76],[27,67,27,76],[27,22,27,31],[27,37,27,46],[27,52,27,61],[1,22,1,31],[1,37,1,46],[1,52,1,61],[14,22,14,31],[14,37,14,46],[14,52,14,61]]}
[null,null,null,null,null,null,null,null,null,null,null,null,null,null,null,null,null,null,null,"Totals",null,"B","AB","AD","AE","AH","AI","AJ","AK","AL","AM","AN",null,null,"AF"]
[null,null,null,null,null,null,null,null,null,null,null,null,null,null,null,null,null,null,null," ",null,1,"Round_1",null,null,null,null,null,null,null,null,null,null,null,null,null,4,"R_4",null,null,null,null,null,null,null,null,null,null,null,null,null,7,"R_7",null,null,null,null,null,null,null,null,null,null,null,null,null,10,"R_10"]
[null,"Quizzees","R=1","R-2","R-3","R-4","R-5","R-6","R-7","R-8","R-9","R-10","R-11","R-12","Total",null,null,null,null,7,null,{"$f":"INDIRECT(\"\"&$W$2&\"!$B\"&$T3)","v":"Red Team"},"Total","Ok's","No's","Rank","10's","20's","30's","-5'S","-10'S","-15'S","Qo","Bo","Quiz-Out",null,{"$f":"INDIRECT(\"\"&$W$2&\"!$B\"&$T3)","v":"Red Team"},"Total","Ok's","No's","Rank","10's","20's","30's","-5'S","-10'S","-15'S","Qo","Bo","Quiz-Out",null,{"$f":"INDIRECT(\"\"&$W$2&\"!$B\"&$T3)","v":"Red Team"},"Total","Ok's","No's","Rank","10's","20's","30's","-5'S","-10'S","-15'S","Qo","Bo","Quiz-Out",null,{"$f":"INDIRECT(\"\"&$W$2&\"!$B\"&$T3)","v":"Red Team"},"Total","Ok's","No's","Rank","10's","20's","30's","-5'S","-10'S","-15'S","Qo","Bo","Quiz-Out"]
[null,{"$f":"V4","v":"Quiz-1"},{"$f":"W4","v":0},{"$f":"W17","v":0},{"$f":"W30","v":0},{"$f":"AL4","v":0},{"$f":"AL17","v":0},{"$f":"AL30","v":0},{"$f":"BA4","v":0},{"$f":"BA17","v":0},{"$f":"BA30","v":0},{"$f":"BP4","v":0},{"$f":"BP17","v":0},{"$f":"BP30","v":0},{"$f":"SUM(C4:N4)","v":0},null,null,null,null,8,null,{"$f":"INDIRECT(\"\"&W2&\"!\"&$V$1&$T4)","v":"Quiz-1"},{"$f":"INDIRECT(\"\"&W2&\"!\"&$W$1&$T$4)","v":0},{"$f":"INDIRECT(\"\"&W2&\"!\"&$X$1&$T4)","v":0},{"$f":"INDIRECT(\"\"&W2&\"!\"&$Y$1&$T4)","v":0},{"$f":"INDIRECT(\"\"&W2&\"!\"&$Z$1&$T4)","v":1},{"$f":"INDIRECT(\"\"&W2&\"!\"&$AA$1&$T4)","v":0},{"$f":"INDIRECT(\"\"&W2&\"!\"&$AB$1&$T4)","v":0},{"$f":"INDIRECT(\"\"&W2&\"!\"&$AC$1&$T4)","v":0},{"$f":"INDIRECT(\"\"&W2&\"!\"&$AD$1&$T4)","v":0},{"$f":"INDIRECT(\"\"&W2&\"!\"&$AE$1&$T4)","v":0},{"$f":"INDIRECT(\"\"&W2&\"!\"&$AF$1&$T4)","v":0},{"$f":"IF(AE4>5,1,0)","v":0},{"$f":"IF(AF4>2,1,0)","v":0},{"$f":"INDIRECT(\"\"&$W$2&\"!\"&$AI$1&$T4)","v":" "},null,{"$f":"INDIRECT(\"\"&AL2&\"!\"&$V$1&$T4)","v":"Quiz-1"},{"$f":"INDIRECT(\"\"&AL2&\"!\"&$W$1&$T$4)","v":0},{"$f":"INDIRECT(\"\"&AL2&\"!\"&$X$1&$T4)","v":0},{"$f":"INDIRECT(\"\"&AL2&\"!\"&$Y$1&$T4)","v":0},{"$f":"INDIRECT(\"\"&AL2&\"!\"&$Z$1&$T4)","v":1},{"$f":"INDIRECT(\"\"&AL2&\"!\"&$AA$1&$T4)","v":0},{"$f":"INDIRECT(\"\"&AL2&\"!\"&$AB$1&$T4)","v":0},{"$f":"INDIRECT(\"\"&AL2&\"!\"&$AC$1&$T4)","v":0},{"$f":"INDIRECT(\"\"&AL2&\"!\"&$AD$1&$T4)","v":0},{"$f":"INDIRECT(\"\"&AL2&\"!\"&$AE$1&$T4)","v":0},{"$f":"INDIRECT(\"\"&AL2&\"!\"&$AF$1&$T4)","v":0},{"$f":"IF(AT4>5,1,0)","v":0},{"$f":"IF(AU4>2,1,0)","v":0},{"$f":"INDIRECT(\"\"&$W$2&\"!\"&$AI$1&$T4)","v":" "},null,{"$f":"INDIRECT(\"\"&BA2&\"!\"&$V$1&$T4)","v":"Quiz-1"},{"$f":"INDIRECT(\"\"&BA2&\"!\"&$W$1&$T$4)","v":0},{"$f":"INDIRECT(\"\"&BA2&\"!\"&$X$1&$T4)","v":0},{"$f":"INDIRECT(\"\"&BA2&\"!\"&$Y$1&$T4)","v":0},{"$f":"INDIRECT(\"\"&BA2&\"!\"&$Z$1&$T4)","v":1},{"$f":"INDIRECT(\"\"&BA2&\"!\"&$AA$1&$T4)","v":0},{"$f":"INDIRECT(\"\"&BA2&\"!\"&$AB$1&$T4)","v":0},{"$f":"INDIRECT(\"\"&BA2&\"!\"&$AC$1&$T4)","v":0},{"$f":"INDIRECT(\"\"&BA2&\"!\"&$AD$1&$T4)","v":0},{"$f":"INDIRECT(\"\"&BA2&\"!\"&$AE$1&$T4)","v":0},{"$f":"INDIRECT(\"\"&BA2&\"!\"&$AF$1&$T4)","v":0},{"$f":"IF(BI4>5,1,0)","v":0},{"$f":"IF(BJ4>2,1,0)","v":0},{"$f":"INDIRECT(\"\"&$W$2&\"!\"&$AI$1&$T4)","v":" "},null,{"$f":"INDIRECT(\"\"&BP2&\"!\"&$V$1&$T4)","v":"Quiz-1"},{"$f":"INDIRECT(\"\"&BP2&\"!\"&$W$1&$T$4)","v":0},{"$f":"INDIRECT(\"\"&BP2&\"!\"&$X$1&$T4)","v":0},{"$f":"INDIRECT(\"\"&BP2&\"!\"&$Y$1&$T4)","v":0},{"$f":"INDIRECT(\"\"&BP2&\"!\"&$Z$1&$T4)","v":1},{"$f":"INDIRECT(\"\"&BP2&\"!\"&$AA$1&$T4)","v":0},{"$f":"INDIRECT(\"\"&BP2&\"!\"&$AB$1&$T4)","v":0},{"$f":"INDIRECT(\"\"&BP2&\"!\"&$AC$1&$T4)","v":0},{"$f":"INDIRECT(\"\"&BP2&\"!\"&$AD$1&$T4)","v":0},{"$f":"INDIRECT(\"\"&BP2&\"!\"&$AE$1&$T4)","v":0},{"$f":"INDIRECT(\"\"&BP2&\"!\"&$AF$1&$T4)","v":0},{"$f":"IF(BX4>5,1,0)","v":0},{"$f":"IF(BY4>2,1,0)","v":0},{"$f":"INDIRECT(\"\"&$W$2&\"!\"&$AI$1&$T4)","v":" "}]
[null,{"$f":"V5","v":0},{"$f":"W5","v":0},{"$f":"W18","v":0},{"$f":"W31","v":0},{"$f":"AL5","v":0},{"$f":"AL18","v":0},{"$f":"AL31","v":0},{"$f":"BA5","v":0},{"$f":"BA18","v":0},{"$f":"BA31","v":0},{"$f":"BP5","v":0},{"$f":"BP18","v":0},{"$f":"BP31","v":0},{"$f":"SUM(C5:N5)","v":0},null,null,null,null,9,null,{"$f":"INDIRECT(\"\"&W2&\"!\"&$V$1&$T5)","v":0},{"$f":"INDIRECT(\"\"&$W2&\"!\"&$W$1&$T$5)","v":0},{"$f":"INDIRECT(\"\"&W2&\"!\"&$X$1&$T$5)","v":0},{"$f":"INDIRECT(\"\"&W2&\"!\"&$Y$1&$T$5)","v":0},{"$f":"INDIRECT(\"\"&W2&\"!\"&$Z$1&$T$5)","v":1},{"$f":"INDIRECT(\"\"&W2&\"!\"&$AA$1&$T$5)","v":0},{"$f":"INDIRECT(\"\"&W2&\"!\"&$AB$1&$T$5)","v":0},{"$f":"INDIRECT(\"\"&W2&\"!\"&$AC$1&$T$5)","v":0},{"$f":"INDIRECT(\"\"&W2&\"!\"&$AD$1&$T5)","v":0},{"$f":"INDIRECT(\"\"&W2&\"!\"&$AE$1&$T5)","v":0},{"$f":"INDIRECT(\"\"&W2&\"!\"&$AF$1&$T5)","v":0},{"$f":"IF(AE5>5,1,0)","v":0},{"$f":"IF(AF5>2,1,0)","v":0}," ",null,{"$f":"INDIRECT(\"\"&AL2&\"!\"&$V$1&$T5)","v":0},{"$f":"INDIRECT(\"\"&$W2&\"!\"&$W$1&$T$5)","v":0},{"$f":"INDIRECT(\"\"&AL2&\"!\"&$X$1&$T$5)","v":0},{"$f":"INDIRECT(\"\"&AL2&\"!\"&$Y$1&$T$5)","v":0},{"$f":"INDIRECT(\"\"&AL2&\"!\"&$Z$1&$T$5)","v":1},{"$f":"INDIRECT(\"\"&AL2&\"!\"&$AA$1&$T$5)","v":0},{"$f":"INDIRECT(\"\"&AL2&\"!\"&$AB$1&$T$5)","v":0},{"$f":"INDIRECT(\"\"&AL2&\"!\"&$AC$1&$T$5)","v":0},{"$f":"INDIRECT(\"\"&AL2&\"!\"&$AD$1&$T5)","v":0},{"$f":"INDIRECT(\"\"&AL2&\"!\"&$AE$1&$T5)","v":0},{"$f":"INDIRECT(\"\"&AL2&\"!\"&$AF$1&$T5)","v":0},{"$f":"IF(AT5>5,1,0)","v":0},{"$f":"IF(AU5>2,1,0)","v":0}," ",null,{"$f":"INDIRECT(\"\"&BA2&\"!\"&$V$1&$T5)","v":0},{"$f":"INDIRECT(\"\"&$W2&\"!\"&$W$1&$T$5)","v":0},{"$f":"INDIRECT(\"\"&BA2&\"!\"&$X$1&$T$5)","v":0},{"$f":"INDIRECT(\"\"&BA2&\"!\"&$Y$1&$T$5)","v":0},{"$f":"INDIRECT(\"\"&BA2&\"!\"&$Z$1&$T$5)","v":1},{"$f":"INDIRECT(\"\"&BA2&\"!\"&$AA$1&$T$5)","v":0},{"$f":"INDIRECT(\"\"&BA2&\"!\"&$AB$1&$T$5)","v":0},{"$f":"INDIRECT(\"\"&BA2&\"!\"&$AC$1&$T$5)","v":0},{"$f":"INDIRECT(\"\"&BA2&\"!\"&$AD$1&$T5)","v":0},{"$f":"INDIRECT(\"\"&BA2&\"!\"&$AE$1&$T5)","v":0},{"$f":"INDIRECT(\"\"&BA2&\"!\"&$AF$1&$T5)","v":0},{"$f":"IF(BI5>5,1,0)","v":0},{"$f":"IF(BJ5>2,1,0)","v":0}," ",null,{"$f":"INDIRECT(\"\"&BP2&\"!\"&$V$1&$T5)","v":0},{"$f":"INDIRECT(\"\"&$W2&\"!\"&$W$1&$T$5)","v":0},{"$f":"INDIRECT(\"\"&BP2&\"!\"&$X$1&$T$5)","v":0},{"$f":"INDIRECT(\"\"&BP2&\"!\"&$Y$1&$T$5)","v":0},{"$f":"INDIRECT(\"\"&BP2&\"!\"&$Z$1&$T$5)","v":1},{"$f":"INDIRECT(\"\"&BP2&\"!\"&$AA$1&$T$5)","v":0},{"$f":"INDIRECT(\"\"&BP2&\"!\"&$AB$1&$T$5)","v":0},{"$f":"INDIRECT(\"\"&BP2&\"!\"&$AC$1&$T$5)","v":0},{"$f":"INDIRECT(\"\"&BP2&\"!\"&$AD$1&$T5)","v":0},{"$f":"INDIRECT(\"\"&BP2&\"!\"&$AE$1&$T5)","v":0},{"$f":"INDIRECT(\"\"&BP2&\"!\"&$AF$1&$T5)","v":0},{"$f":"IF(BX5>5,1,0)","v":0},{"$f":"IF(BY5>2,1,0)","v":0}," "]
[null,"Quiz-2",0,0,0,0,0,0,0,0,0,0,0,0,0,null,null,null,null,10,null,{"$f":"INDIRECT(\"\"&W2&\"!\"&$V$1&$T6)","v":"Quiz-2"},{"$f":"INDIRECT(\"\"&W2&\"!\"&$W$1&$T6)","v":0},{"$f":"INDIRECT(\"\"&W2&\"!\"&$X$1&$T6)","v":0},{"$f":"INDIRECT(\"\"&W2&\"!\"&$Y$1&$T6)","v":0},{"$f":"INDIRECT(\"\"&W2&\"!\"&$Z$1&$T6)","v":1},{"$f":"INDIRECT(\"\"&W2&\"!\"&$AA$1&$T6)","v":0},{"$f":"INDIRECT(\"\"&W2&\"!\"&$AB$1&$T6)","v":0},{"$f":"INDIRECT(\"\"&W2&\"!\"&$AC$1&$T6)","v":0},{"$f":"INDIRECT(\"\"&W2&\"!\"&$AD$1&$T6)","v":0},{"$f":"INDIRECT(\"\"&W2&\"!\"&$AE$1&$T6)","v":0},{"$f":"INDIRECT(\"\"&W2&\"!\"&$AF$1&$T6)","v":0},{"$f":"IF(AE6>5,1,0)","v":0},{"$f":"IF(AF6>2,1,0)","v":0}," ",null,{"$f":"INDIRECT(\"\"&AL2&\"!\"&$V$1&$T6)","v":"Quiz-2"},{"$f":"INDIRECT(\"\"&AL2&\"!\"&$W$1&$T6)","v":0},{"$f":"INDIRECT(\"\"&AL2&\"!\"&$X$1&$T6)","v":0},{"$f":"INDIRECT(\"\"&AL2&\"!\"&$Y$1&$T6)","v":0},{"$f":"INDIRECT(\"\"&AL2&\"!\"&$Z$1&$T6)","v":1},{"$f":"INDIRECT(\"\"&AL2&\"!\"&$AA$1&$T6)","v":0},{"$f":"INDIRECT(\"\"&AL2&\"!\"&$AB$1&$T6)","v":0},{"$f":"INDIRECT(\"\"&AL2&\"!\"&$AC$1&$T6)","v":0},{"$f":"INDIRECT(\"\"&AL2&\"!\"&$AD$1&$T6)","v":0},{"$f":"INDIRECT(\"\"&AL2&\"!\"&$AE$1&$T6)","v":0},{"$f":"INDIRECT(\"\"&AL2&\"!\"&$AF$1&$T6)","v":0},{"$f":"IF(AT6>5,1,0)","v":0},{"$f":"IF(AU6>2,1,0)","v":0}," ",null,{"$f":"INDIRECT(\"\"&BA2&\"!\"&$V$1&$T6)","v":"Quiz-2"},{"$f":"INDIRECT(\"\"&BA2&\"!\"&$W$1&$T6)","v":0},{"$f":"INDIRECT(\"\"&BA2&\"!\"&$X$1&$T6)","v":0},{"$f":"INDIRECT(\"\"&BA2&\"!\"&$Y$1&$T6)","v":0},{"$f":"INDIRECT(\"\"&BA2&\"!\"&$Z$1&$T6)","v":1},{"$f":"INDIRECT(\"\"&BA2&\"!\"&$AA$1&$T6)","v":0},{"$f":"INDIRECT(\"\"&BA2&\"!\"&$AB$1&$T6)","v":0},{"$f":"INDIRECT(\"\"&BA2&\"!\"&$AC$1&$T6)","v":0},{"$f":"INDIRECT(\"\"&BA2&\"!\"&$AD$1&$T6)","v":0},{"$f":"INDIRECT(\"\"&BA2&\"!\"&$AE$1&$T6)","v":0},{"$f":"INDIRECT(\"\"&BA2&\"!\"&$AF$1&$T6)","v":0},{"$f":"IF(BI6>5,1,0)","v":0},{"$f":"IF(BJ6>2,1,0)","v":0}," ",null,{"$f":"INDIRECT(\"\"&BP2&\"!\"&$V$1&$T6)","v":"Quiz-2"},{"$f":"INDIRECT(\"\"&BP2&\"!\"&$W$1&$T6)","v":0},{"$f":"INDIRECT(\"\"&BP2&\"!\"&$X$1&$T6)","v":0},{"$f":"INDIRECT(\"\"&BP2&\"!\"&$Y$1&$T6)","v":0},{"$f":"INDIRECT(\"\"&BP2&\"!\"&$Z$1&$T6)","v":1},{"$f":"INDIRECT(\"\"&BP2&\"!\"&$AA$1&$T6)","v":0},{"$f":"INDIRECT(\"\"&BP2&\"!\"&$AB$1&$T6)","v":0},{"$f":"INDIRECT(\"\"&BP2&\"!\"&$AC$1&$T6)","v":0},{"$f":"INDIRECT(\"\"&BP2&\"!\"&$AD$1&$T6)","v":0},{"$f":"INDIRECT(\"\"&BP2&\"!\"&$AE$1&$T6)","v":0},{"$f":"INDIRECT(\"\"&BP2&\"!\"&$AF$1&$T6)","v":0},{"$f":"IF(BX6>5,1,0)","v":0},{"$f":"IF(BY6>2,1,0)","v":0}," "]
[null,0,0,0,0,0,0,0,0,0,0,0,0,0,0,null,null,null,null,11,null,{"$f":"INDIRECT(\"\"&W2&\"!\"&$V$1&$T7)","v":0},{"$f":"INDIRECT(\"\"&W2&\"!\"&$W$1&$T7)","v":0},{"$f":"INDIRECT(\"\"&W2&\"!\"&$X$1&$T7)","v":0},{"$f":"INDIRECT(\"\"&W2&\"!\"&$Y$1&$T7)","v":0},{"$f":"INDIRECT(\"\"&W2&\"!\"&$Z$1&$T7)","v":1},{"$f":"INDIRECT(\"\"&W2&\"!\"&$AA$1&$T7)","v":0},{"$f":"INDIRECT(\"\"&W2&\"!\"&$AB$1&$T7)","v":0},{"$f":"INDIRECT(\"\"&W2&\"!\"&$AC$1&$T7)","v":0},{"$f":"INDIRECT(\"\"&W2&\"!\"&$AD$1&$T7)","v":0},{"$f":"INDIRECT(\"\"&W2&\"!\"&$AE$1&$T7)","v":0},{"$f":"INDIRECT(\"\"&W2&\"!\"&$AF$1&$T7)","v":0},0,0," ",null,{"$f":"INDIRECT(\"\"&AL2&\"!\"&$V$1&$T7)","v":0},{"$f":"INDIRECT(\"\"&AL2&\"!\"&$W$1&$T7)","v":0},{"$f":"INDIRECT(\"\"&AL2&\"!\"&$X$1&$T7)","v":0},{"$f":"INDIRECT(\"\"&AL2&\"!\"&$Y$1&$T7)","v":0},{"$f":"INDIRECT(\"\"&AL2&\"!\"&$Z$1&$T7)","v":1},{"$f":"INDIRECT(\"\"&AL2&\"!\"&$AA$1&$T7)","v":0},{"$f":"INDIRECT(\"\"&AL2&\"!\"&$AB$1&$T7)","v":0},{"$f":"INDIRECT(\"\"&AL2&\"!\"&$AC$1&$T7)","v":0},{"$f":"INDIRECT(\"\"&AL2&\"!\"&$AD$1&$T7)","v":0},{"$f":"INDIRECT(\"\"&AL2&\"!\"&$AE$1&$T7)","v":0},{"$f":"INDIRECT(\"\"&AL2&\"!\"&$AF$1&$T7)","v":0},0,0," ",null,{"$f":"INDIRECT(\"\"&BA2&\"!\"&$V$1&$T7)","v":0},{"$f":"INDIRECT(\"\"&BA2&\"!\"&$W$1&$T7)","v":0},{"$f":"INDIRECT(\"\"&BA2&\"!\"&$X$1&$T7)","v":0},{"$f":"INDIRECT(\"\"&BA2&\"!\"&$Y$1&$T7)","v":0},{"$f":"INDIRECT(\"\"&BA2&\"!\"&$Z$1&$T7)","v":1},{"$f":"INDIRECT(\"\"&BA2&\"!\"&$AA$1&$T7)","v":0},{"$f":"INDIRECT(\"\"&BA2&\"!\"&$AB$1&$T7)","v":0},{"$f":"INDIRECT(\"\"&BA2&\"!\"&$AC$1&$T7)","v":0},{"$f":"INDIRECT(\"\"&BA2&\"!\"&$AD$1&$T7)","v":0},{"$f":"INDIRECT(\"\"&BA2&\"!\"&$AE$1&$T7)","v":0},{"$f":"INDIRECT(\"\"&BA2&\"!\"&$AF$1&$T7)","v":0},0,0," ",null,{"$f":"INDIRECT(\"\"&BP2&\"!\"&$V$1&$T7)","v":0},{"$f":"INDIRECT(\"\"&BP2&\"!\"&$W$1&$T7)","v":0},{"$f":"INDIRECT(\"\"&BP2&\"!\"&$X$1&$T7)","v":0},{"$f":"INDIRECT(\"\"&BP2&\"!\"&$Y$1&$T7)","v":0},{"$f":"INDIRECT(\"\"&BP2&\"!\"&$Z$1&$T7)","v":1},{"$f":"INDIRECT(\"\"&BP2&\"!\"&$AA$1&$T7)","v":0},{"$f":"INDIRECT(\"\"&BP2&\"!\"&$AB$1&$T7)","v":0},{"$f":"INDIRECT(\"\"&BP2&\"!\"&$AC$1&$T7)","v":0},{"$f":"INDIRECT(\"\"&BP2&\"!\"&$AD$1&$T7)","v":0},{"$f":"INDIRECT(\"\"&BP2&\"!\"&$AE$1&$T7)","v":0},{"$f":"INDIRECT(\"\"&BP2&\"!\"&$AF$1&$T7)","v":0},0,0," "]
[null,"Quiz-3",0,0,0,0,0,0,0,0,0,0,0,0,0,null,null,null,null,12,null,{"$f":"INDIRECT(\"\"&W2&\"!\"&$V$1&$T8)","v":"Quiz-3"},{"$f":"INDIRECT(\"\"&W2&\"!\"&$W$1&$T8)","v":0},{"$f":"INDIRECT(\"\"&W2&\"!\"&$X$1&$T8)","v":0},{"$f":"INDIRECT(\"\"&W2&\"!\"&$Y$1&$T8)","v":0},{"$f":"INDIRECT(\"\"&W2&\"!\"&$Z$1&$T8)","v":1},{"$f":"INDIRECT(\"\"&W2&\"!\"&$AA$1&$T8)","v":0},{"$f":"INDIRECT(\"\"&W2&\"!\"&$AB$1&$T8)","v":0},{"$f":"INDIRECT(\"\"&W2&\"!\"&$AC$1&$T8)","v":0},{"$f":"INDIRECT(\"\"&W2&\"!\"&$AD$1&$T8)","v":0},{"$f":"INDIRECT(\"\"&W2&\"!\"&$AE$1&$T8)","v":0},{"$f":"INDIRECT(\"\"&W2&\"!\"&$AF$1&$T8)","v":0},0,0," ",null,{"$f":"INDIRECT(\"\"&AL2&\"!\"&$V$1&$T8)","v":"Quiz-3"},{"$f":"INDIRECT(\"\"&AL2&\"!\"&$W$1&$T8)","v":0},{"$f":"INDIRECT(\"\"&AL2&\"!\"&$X$1&$T8)","v":0},{"$f":"INDIRECT(\"\"&AL2&\"!\"&$Y$1&$T8)","v":0},{"$f":"INDIRECT(\"\"&AL2&\"!\"&$Z$1&$T8)","v":1},{"$f":"INDIRECT(\"\"&AL2&\"!\"&$AA$1&$T8)","v":0},{"$f":"INDIRECT(\"\"&AL2&\"!\"&$AB$1&$T8)","v":0},{"$f":"INDIRECT(\"\"&AL2&\"!\"&$AC$1&$T8)","v":0},{"$f":"INDIRECT(\"\"&AL2&\"!\"&$AD$1&$T8)","v":0},{"$f":"INDIRECT(\"\"&AL2&\"!\"&$AE$1&$T8)","v":0},{"$f":"INDIRECT(\"\"&AL2&\"!\"&$AF$1&$T8)","v":0},0,0," ",null,{"$f":"INDIRECT(\"\"&BA2&\"!\"&$V$1&$T8)","v":"Quiz-3"},{"$f":"INDIRECT(\"\"&BA2&\"!\"&$W$1&$T8)","v":0},{"$f":"INDIRECT(\"\"&BA2&\"!\"&$X$1&$T8)","v":0},{"$f":"INDIRECT(\"\"&BA2&\"!\"&$Y$1&$T8)","v":0},{"$f":"INDIRECT(\"\"&BA2&\"!\"&$Z$1&$T8)","v":1},{"$f":"INDIRECT(\"\"&BA2&\"!\"&$AA$1&$T8)","v":0},{"$f":"INDIRECT(\"\"&BA2&\"!\"&$AB$1&$T8)","v":0},{"$f":"INDIRECT(\"\"&BA2&\"!\"&$AC$1&$T8)","v":0},{"$f":"INDIRECT(\"\"&BA2&\"!\"&$AD$1&$T8)","v":0},{"$f":"INDIRECT(\"\"&BA2&\"!\"&$AE$1&$T8)","v":0},{"$f":"INDIRECT(\"\"&BA2&\"!\"&$AF$1&$T8)","v":0},0,0," ",null,{"$f":"INDIRECT(\"\"&BP2&\"!\"&$V$1&$T8)","v":"Quiz-3"},{"$f":"INDIRECT(\"\"&BP2&\"!\"&$W$1&$T8)","v":0},{"$f":"INDIRECT(\"\"&BP2&\"!\"&$X$1&$T8)","v":0},{"$f":"INDIRECT(\"\"&BP2&\"!\"&$Y$1&$T8)","v":0},{"$f":"INDIRECT(\"\"&BP2&\"!\"&$Z$1&$T8)","v":1},{"$f":"INDIRECT(\"\"&BP2&\"!\"&$AA$1&$T8)","v":0},{"$f":"INDIRECT(\"\"&BP2&\"!\"&$AB$1&$T8)","v":0},{"$f":"INDIRECT(\"\"&BP2&\"!\"&$AC$1&$T8)","v":0},{"$f":"INDIRECT(\"\"&BP2&\"!\"&$AD$1&$T8)","v":0},{"$f":"INDIRECT(\"\"&BP2&\"!\"&$AE$1&$T8)","v":0},{"$f":"INDIRECT(\"\"&BP2&\"!\"&$AF$1&$T8)","v":0},0,0," "]
[null,0,0,0,0,0,0,0,0,0,0,0,0,0,0,null,null,null,null,13,null,{"$f":"INDIRECT(\"\"&W2&\"!\"&$V$1&$T9)","v":0},{"$f":"INDIRECT(\"\"&W2&\"!\"&$W$1&$T9)","v":0},{"$f":"INDIRECT(\"\"&W2&\"!\"&$X$1&$T9)","v":0},{"$f":"INDIRECT(\"\"&W2&\"!\"&$Y$1&$T9)","v":0},{"$f":"INDIRECT(\"\"&W2&\"!\"&$Z$1&$T9)","v":1},{"$f":"INDIRECT(\"\"&W2&\"!\"&$AA$1&$T9)","v":0},{"$f":"INDIRECT(\"\"&W2&\"!\"&$AB$1&$T9)","v":0},{"$f":"INDIRECT(\"\"&W2&\"!\"&$AC$1&$T9)","v":0},{"$f":"INDIRECT(\"\"&W2&\"!\"&$AD$1&$T9)","v":0},{"$f":"INDIRECT(\"\"&W2&\"!\"&$AE$1&$T9)","v":0},{"$f":"INDIRECT(\"\"&W2&\"!\"&$AF$1&$T9)","v":0},0,0," ",null,{"$f":"INDIRECT(\"\"&AL2&\"!\"&$V$1&$T9)","v":0},{"$f":"INDIRECT(\"\"&AL2&\"!\"&$W$1&$T9)","v":0},{"$f":"INDIRECT(\"\"&AL2&\"!\"&$X$1&$T9)","v":0},{"$f":"INDIRECT(\"\"&AL2&\"!\"&$Y$1&$T9)","v":0},{"$f":"INDIRECT(\"\"&AL2&\"!\"&$Z$1&$T9)","v":1},{"$f":"INDIRECT(\"\"&AL2&\"!\"&$AA$1&$T9)","v":0},{"$f":"INDIRECT(\"\"&AL2&\"!\"&$AB$1&$T9)","v":0},{"$f":"INDIRECT(\"\"&AL2&\"!\"&$AC$1&$T9)","v":0},{"$f":"INDIRECT(\"\"&AL2&\"!\"&$AD$1&$T9)","v":0},{"$f":"INDIRECT(\"\"&AL2&\"!\"&$AE$1&$T9)","v":0},{"$f":"INDIRECT(\"\"&AL2&\"!\"&$AF$1&$T9)","v":0},0,0," ",null,{"$f":"INDIRECT(\"\"&BA2&\"!\"&$V$1&$T9)","v":0},{"$f":"INDIRECT(\"\"&BA2&\"!\"&$W$1&$T9)","v":0},{"$f":"INDIRECT(\"\"&BA2&\"!\"&$X$1&$T9)","v":0},{"$f":"INDIRECT(\"\"&BA2&\"!\"&$Y$1&$T9)","v":0},{"$f":"INDIRECT(\"\"&BA2&\"!\"&$Z$1&$T9)","v":1},{"$f":"INDIRECT(\"\"&BA2&\"!\"&$AA$1&$T9)","v":0},{"$f":"INDIRECT(\"\"&BA2&\"!\"&$AB$1&$T9)","v":0},{"$f":"INDIRECT(\"\"&BA2&\"!\"&$AC$1&$T9)","v":0},{"$f":"INDIRECT(\"\"&BA2&\"!\"&$AD$1&$T9)","v":0},{"$f":"INDIRECT(\"\"&BA2&\"!\"&$AE$1&$T9)","v":0},{"$f":"INDIRECT(\"\"&BA2&\"!\"&$AF$1&$T9)","v":0},0,0," ",null,{"$f":"INDIRECT(\"\"&BP2&\"!\"&$V$1&$T9)","v":0},{"$f":"INDIRECT(\"\"&BP2&\"!\"&$W$1&$T9)","v":0},{"$f":"INDIRECT(\"\"&BP2&\"!\"&$X$1&$T9)","v":0},{"$f":"INDIRECT(\"\"&BP2&\"!\"&$Y$1&$T9)","v":0},{"$f":"INDIRECT(\"\"&BP2&\"!\"&$Z$1&$T9)","v":1},{"$f":"INDIRECT(\"\"&BP2&\"!\"&$AA$1&$T9)","v":0},{"$f":"INDIRECT(\"\"&BP2&\"!\"&$AB$1&$T9)","v":0},{"$f":"INDIRECT(\"\"&BP2&\"!\"&$AC$1&$T9)","v":0},{"$f":"INDIRECT(\"\"&BP2&\"!\"&$AD$1&$T9)","v":0},{"$f":"INDIRECT(\"\"&BP2&\"!\"&$AE$1&$T9)","v":0},{"$f":"INDIRECT(\"\"&BP2&\"!\"&$AF$1&$T9)","v":0},0,0," "]
[null,"Quiz-4",0,0,0,0,0,0,0,0,0,0,0,0,0,null,null,null,null,14,null,{"$f":"INDIRECT(\"\"&W2&\"!\"&$V$1&$T10)","v":"Quiz-4"},{"$f":"INDIRECT(\"\"&W2&\"!\"&$W$1&$T10)","v":0},{"$f":"INDIRECT(\"\"&W2&\"!\"&$X$1&$T10)","v":0},{"$f":"INDIRECT(\"\"&W2&\"!\"&$Y$1&$T10)","v":0},{"$f":"INDIRECT(\"\"&W2&\"!\"&$Z$1&$T10)","v":1},{"$f":"INDIRECT(\"\"&W2&\"!\"&$AA$1&$T10)","v":0},{"$f":"INDIRECT(\"\"&W2&\"!\"&$AB$1&$T10)","v":0},{"$f":"INDIRECT(\"\"&W2&\"!\"&$AC$1&$T10)","v":0},{"$f":"INDIRECT(\"\"&W2&\"!\"&$AD$1&$T10)","v":0},{"$f":"INDIRECT(\"\"&W2&\"!\"&$AE$1&$T10)","v":0},{"$f":"INDIRECT(\"\"&W2&\"!\"&$AF$1&$T10)","v":0},0,0," ",null,{"$f":"INDIRECT(\"\"&AL2&\"!\"&$V$1&$T10)","v":"Quiz-4"},{"$f":"INDIRECT(\"\"&AL2&\"!\"&$W$1&$T10)","v":0},{"$f":"INDIRECT(\"\"&AL2&\"!\"&$X$1&$T10)","v":0},{"$f":"INDIRECT(\"\"&AL2&\"!\"&$Y$1&$T10)","v":0},{"$f":"INDIRECT(\"\"&AL2&\"!\"&$Z$1&$T10)","v":1},{"$f":"INDIRECT(\"\"&AL2&\"!\"&$AA$1&$T10)","v":0},{"$f":"INDIRECT(\"\"&AL2&\"!\"&$AB$1&$T10)","v":0},{"$f":"INDIRECT(\"\"&AL2&\"!\"&$AC$1&$T10)","v":0},{"$f":"INDIRECT(\"\"&AL2&\"!\"&$AD$1&$T10)","v":0},{"$f":"INDIRECT(\"\"&AL2&\"!\"&$AE$1&$T10)","v":0},{"$f":"INDIRECT(\"\"&AL2&\"!\"&$AF$1&$T10)","v":0},0,0," ",null,{"$f":"INDIRECT(\"\"&BA2&\"!\"&$V$1&$T10)","v":"Quiz-4"},{"$f":"INDIRECT(\"\"&BA2&\"!\"&$W$1&$T10)","v":0},{"$f":"INDIRECT(\"\"&BA2&\"!\"&$X$1&$T10)","v":0},{"$f":"INDIRECT(\"\"&BA2&\"!\"&$Y$1&$T10)","v":0},{"$f":"INDIRECT(\"\"&BA2&\"!\"&$Z$1&$T10)","v":1},{"$f":"INDIRECT(\"\"&BA2&\"!\"&$AA$1&$T10)","v":0},{"$f":"INDIRECT(\"\"&BA2&\"!\"&$AB$1&$T10)","v":0},{"$f":"INDIRECT(\"\"&BA2&\"!\"&$AC$1&$T10)","v":0},{"$f":"INDIRECT(\"\"&BA2&\"!\"&$AD$1&$T10)","v":0},{"$f":"INDIRECT(\"\"&BA2&\"!\"&$AE$1&$T10)","v":0},{"$f":"INDIRECT(\"\"&BA2&\"!\"&$AF$1&$T10)","v":0},0,0," ",null,{"$f":"INDIRECT(\"\"&BP2&\"!\"&$V$1&$T10)","v":"Quiz-4"},{"$f":"INDIRECT(\"\"&BP2&\"!\"&$W$1&$T10)","v":0},{"$f":"INDIRECT(\"\"&BP2&\"!\"&$X$1&$T10)","v":0},{"$f":"INDIRECT(\"\"&BP2&\"!\"&$Y$1&$T10)","v":0},{"$f":"INDIRECT(\"\"&BP2&\"!\"&$Z$1&$T10)","v":1},{"$f":"INDIRECT(\"\"&BP2&\"!\"&$AA$1&$T10)","v":0},{"$f":"INDIRECT(\"\"&BP2&\"!\"&$AB$1&$T10)","v":0},{"$f":"INDIRECT(\"\"&BP2&\"!\"&$AC$1&$T10)","v":0},{"$f":"INDIRECT(\"\"&BP2&\"!\"&$AD$1&$T10)","v":0},{"$f":"INDIRECT(\"\"&BP2&\"!\"&$AE$1&$T10)","v":0},{"$f":"INDIRECT(\"\"&BP2&\"!\"&$AF$1&$T10)","v":0},0,0," "]
[null,0,0,0,0,0,0,0,0,0,0,0,0,0,0,null,null,null,null,15,null,{"$f":"INDIRECT(\"\"&W2&\"!\"&$V$1&$T11)","v":0},{"$f":"INDIRECT(\"\"&W2&\"!\"&$W$1&$T11)","v":0},{"$f":"INDIRECT(\"\"&W2&\"!\"&$X$1&$T11)","v":0},{"$f":"INDIRECT(\"\"&W2&\"!\"&$Y$1&$T11)","v":0},{"$f":"INDIRECT(\"\"&W2&\"!\"&$Z$1&$T11)","v":1},{"$f":"INDIRECT(\"\"&W2&\"!\"&$AA$1&$T11)","v":0},{"$f":"INDIRECT(\"\"&W2&\"!\"&$AB$1&$T11)","v":0},{"$f":"INDIRECT(\"\"&W2&\"!\"&$AC$1&$T11)","v":0},{"$f":"INDIRECT(\"\"&W2&\"!\"&$AD$1&$T11)","v":0},{"$f":"INDIRECT(\"\"&W2&\"!\"&$AE$1&$T11)","v":0},{"$f":"INDIRECT(\"\"&W2&\"!\"&$AF$1&$T11)","v":0},0,0," ",null,{"$f":"INDIRECT(\"\"&AL2&\"!\"&$V$1&$T11)","v":0},{"$f":"INDIRECT(\"\"&AL2&\"!\"&$W$1&$T11)","v":0},{"$f":"INDIRECT(\"\"&AL2&\"!\"&$X$1&$T11)","v":0},{"$f":"INDIRECT(\"\"&AL2&\"!\"&$Y$1&$T11)","v":0},{"$f":"INDIRECT(\"\"&AL2&\"!\"&$Z$1&$T11)","v":1},{"$f":"INDIRECT(\"\"&AL2&\"!\"&$AA$1&$T11)","v":0},{"$f":"INDIRECT(\"\"&AL2&\"!\"&$AB$1&$T11)","v":0},{"$f":"INDIRECT(\"\"&AL2&\"!\"&$AC$1&$T11)","v":0},{"$f":"INDIRECT(\"\"&AL2&\"!\"&$AD$1&$T11)","v":0},{"$f":"INDIRECT(\"\"&AL2&\"!\"&$AE$1&$T11)","v":0},{"$f":"INDIRECT(\"\"&AL2&\"!\"&$AF$1&$T11)","v":0},0,0," ",null,{"$f":"INDIRECT(\"\"&BA2&\"!\"&$V$1&$T11)","v":0},{"$f":"INDIRECT(\"\"&BA2&\"!\"&$W$1&$T11)","v":0},{"$f":"INDIRECT(\"\"&BA2&\"!\"&$X$1&$T11)","v":0},{"$f":"INDIRECT(\"\"&BA2&\"!\"&$Y$1&$T11)","v":0},{"$f":"INDIRECT(\"\"&BA2&\"!\"&$Z$1&$T11)","v":1},{"$f":"INDIRECT(\"\"&BA2&\"!\"&$AA$1&$T11)","v":0},{"$f":"INDIRECT(\"\"&BA2&\"!\"&$AB$1&$T11)","v":0},{"$f":"INDIRECT(\"\"&BA2&\"!\"&$AC$1&$T11)","v":0},{"$f":"INDIRECT(\"\"&BA2&\"!\"&$AD$1&$T11)","v":0},{"$f":"INDIRECT(\"\"&BA2&\"!\"&$AE$1&$T11)","v":0},{"$f":"INDIRECT(\"\"&BA2&\"!\"&$AF$1&$T11)","v":0},0,0," ",null,{"$f":"INDIRECT(\"\"&BP2&\"!\"&$V$1&$T11)","v":0},{"$f":"INDIRECT(\"\"&BP2&\"!\"&$W$1&$T11)","v":0},{"$f":"INDIRECT(\"\"&BP2&\"!\"&$X$1&$T11)","v":0},{"$f":"INDIRECT(\"\"&BP2&\"!\"&$Y$1&$T11)","v":0},{"$f":"INDIRECT(\"\"&BP2&\"!\"&$Z$1&$T11)","v":1},{"$f":"INDIRECT(\"\"&BP2&\"!\"&$AA$1&$T11)","v":0},{"$f":"INDIRECT(\"\"&BP2&\"!\"&$AB$1&$T11)","v":0},{"$f":"INDIRECT(\"\"&BP2&\"!\"&$AC$1&$T11)","v":0},{"$f":"INDIRECT(\"\"&BP2&\"!\"&$AD$1&$T11)","v":0},{"$f":"INDIRECT(\"\"&BP2&\"!\"&$AE$1&$T11)","v":0},{"$f":"INDIRECT(\"\"&BP2&\"!\"&$AF$1&$T11)","v":0},0,0," "]
[null,"Team Fouls",0,0,0,0,0,0,0,0,0,0,0,0,0,null,null,null,null,16,null,{"$f":"INDIRECT(\"\"&W2&\"!\"&$V$1&$T12)","v":"Team Fouls"},{"$f":"INDIRECT(\"\"&W2&\"!\"&$W$1&$T12)","v":0},null,null,null,null,null,null,null,null,null,null,null,null,null,{"$f":"INDIRECT(\"\"&AL2&\"!\"&$V$1&$T12)","v":"Team Fouls"},{"$f":"INDIRECT(\"\"&AL2&\"!\"&$W$1&$T12)","v":0},null,null,null,null,null,null,null,null,null,null,null,null,null,{"$f":"INDIRECT(\"\"&BA2&\"!\"&$V$1&$T12)","v":"Team Fouls"},{"$f":"INDIRECT(\"\"&BA2&\"!\"&$W$1&$T12)","v":0},null,null,null,null,null,null,null,null,null,null,null,null,null,{"$f":"INDIRECT(\"\"&BP2&\"!\"&$V$1&$T12)","v":"Team Fouls"},{"$f":"INDIRECT(\"\"&BP2&\"!\"&$W$1&$T12)","v":0}]
[null,"Total",{"$f":"SUM(C4:C12)","v":0},{"$f":"SUM(D4:D12)","v":0},0,0,0,0,0,0,0,0,{"$f":"SUM(M4:M12)","v":0},{"$f":"SUM(N4:N12)","v":0},{"$f":"SUM(E13:N13)","v":0},null,null,null,null,19,null,"Total",{"$f":"SUM(W4:W12)","v":0},{"$f":"SUM(X4:X11)","v":0},0,8,null,0,0,0,0,0,0,{"$f":"SUM(AH4:AH11)","v":0},null,null,"Total",{"$f":"SUM(AL4:AL12)","v":0},{"$f":"SUM(AM4:AM11)","v":0},{"$f":"SUM(AN4:AN11)","v":0},{"$f":"SUM(AO4:AO11)","v":8},null,{"$f":"SUM(AQ4:AQ11)","v":0},0,0,0,0,0,{"$f":"SUM(AW4:AW11)","v":0},null,null,"Total",{"$f":"SUM(BA4:BA12)","v":0},{"$f":"SUM(BB4:BB11)","v":0},{"$f":"SUM(BC4:BC11)","v":0},{"$f":"SUM(BD4:BD11)","v":8},null,{"$f":"SUM(BF4:BF11)","v":0},0,0,0,0,0,{"$f":"SUM(BL4:BL11)","v":0},null,null,"Total",{"$f":"SUM(BP4:BP12)","v":0},{"$f":"SUM(BQ4:BQ11)","v":0},{"$f":"SUM(BR4:BR11)","v":0},{"$f":"SUM(BS4:BS11)","v":8},null,{"$f":"SUM(BU4:BU11)","v":0},0,0,0,0,0,{"$f":"SUM(CA4:CA11)","v":0}]
[null,null,null,null,null,null,null,null,null,null,null,null,null,null,null,null,null,null,null,28,null,{"$f":"INDIRECT(\"\"&$W2&\"!\"&$V$1&$T13)","v":"Green Team"},{"$f":"INDIRECT(\"\"&$W2&\"!\"&$W$1&$T14)","v":0},null,null,null,null,null,null,null,null,null,null,null,null,null,{"$f":"INDIRECT(\"\"&$AL2&\"!\"&$V$1&$T13)","v":"Green Team"},{"$f":"INDIRECT(\"\"&$AL2&\"!\"&$W$1&$T14)","v":0},null,null,null,null,null,null,null,null,null,null,null,null,null,{"$f":"INDIRECT(\"\"&$BA2&\"!\"&$V$1&$T13)","v":"Green Team"},{"$f":"INDIRECT(\"\"&$BA2&\"!\"&$W$1&$T14)","v":0},null,null,null,null,null,null,null,null,null,null,null,null,null,{"$f":"INDIRECT(\"\"&$BP2&\"!\"&$V$1&$T13)","v":"Green Team"},{"$f":"INDIRECT(\"\"&$BP2&\"!\"&$W$1&$T14)","v":0}]
[null,null,null,null,null,null,null,null,null,null,null,null,null,null,null,null,null,null,null,null,null,2,"R_2",null,null,null,null,null,null,null,null,null,null,null,null,null,5,"R_5",null,null,null,null,null,null,null,null,null,null,null,null,null,8,"R_8",null,null,null,null,null,null,null,null,null,null,null,null,null,11,"R_11"]
[null,"Team Color",{"$f":"INDIRECT(\"\"&$W2&\"!\"&$AF$1&1)","v":"Negs"},{"$f":"INDIRECT(\"\"&$W15&\"!\"&$AF$1&1)","v":"Negs"},{"$f":"INDIRECT(\"\"&$W28&\"!\"&$AF$1&1)","v":"Negs"},{"$f":"INDIRECT(\"\"&$AL2&\"!\"&$AF$1&1)","v":"Negs"},{"$f":"INDIRECT(\"\"&$AL15&\"!\"&$AF$1&1)","v":"Negs"},{"$f":"INDIRECT(\"\"&$AL28&\"!\"&$AF$1&1)","v":"Negs"},{"$f":"INDIRECT(\"\"&$BA2&\"!\"&$AF$1&1)","v":"Negs"},{"$f":"INDIRECT(\"\"&$BA15&\"!\"&$AF$1&1)","v":"Negs"},{"$f":"INDIRECT(\"\"&$BA28&\"!\"&$AF$1&1)","v":"Negs"},{"$f":"INDIRECT(\"\"&$BP2&\"!\"&$AF$1&1)","v":"Negs"},{"$f":"INDIRECT(\"\"&$BP15&\"!\"&$AF$1&1)","v":"Negs"},{"$f":"INDIRECT(\"\"&$BP28&\"!\"&$AF$1&1)","v":"Negs"},null,null,null,null,null,7,null,{"$f":"INDIRECT(\"\"&$W$2&\"!$B\"&$T16)","v":"Red Team"},"Total","Ok's","No's","Rank","10's","20's","30's","-5'S","-10'S","-15'S","Qo","Bo","Quiz-Out",null,{"$f":"INDIRECT(\"\"&$W$2&\"!$B\"&$T16)","v":"Red Team"},"Total","Ok's","No's","Rank","10's","20's","30's","-5'S","-10'S","-15'S","Qo","Bo","Quiz-Out",null,{"$f":"INDIRECT(\"\"&$W$2&\"!$B\"&$T16)","v":"Red Team"},"Total","Ok's","No's","Rank","10's","20's","30's","-5'S","-10'S","-15'S","Qo","Bo","Quiz-Out",null,{"$f":"INDIRECT(\"\"&$W$2&\"!$B\"&$T16)","v":"Red Team"},"Total","Ok's","No's","Rank","10's","20's","30's","-5'S","-10'S","-15'S","Qo","Bo","Quiz-Out"]
[null,null,null,null,null,null,null,null,null,null,null,null,null,null,null,null,null,null,null,8,null,{"$f":"INDIRECT(\"\"&W15&\"!\"&$V$1&$T17)","v":"Quiz-1"},{"$f":"INDIRECT(\"\"&W15&\"!\"&$W$1&$T$4)","v":0},{"$f":"INDIRECT(\"\"&W15&\"!\"&$X$1&$T17)","v":0},{"$f":"INDIRECT(\"\"&W15&\"!\"&$Y$1&$T17)","v":0},{"$f":"INDIRECT(\"\"&W15&\"!\"&$Z$1&$T17)","v":1},{"$f":"INDIRECT(\"\"&W15&\"!\"&$AA$1&$T17)","v":0},{"$f":"INDIRECT(\"\"&W15&\"!\"&$AB$1&$T17)","v":0},{"$f":"INDIRECT(\"\"&W15&\"!\"&$AC$1&$T17)","v":0},{"$f":"INDIRECT(\"\"&W15&\"!\"&$AD$1&$T17)","v":0},{"$f":"INDIRECT(\"\"&W15&\"!\"&$AE$1&$T17)","v":0},{"$f":"INDIRECT(\"\"&W15&\"!\"&$AF$1&$T17)","v":0},{"$f":"IF(AE17>5,1,0)","v":0},{"$f":"IF(AF17>2,1,0)","v":0},{"$f":"INDIRECT(\"\"&$W$2&\"!\"&$AI$1&$T17)","v":" "},null,{"$f":"INDIRECT(\"\"&AL15&\"!\"&$V$1&$T17)","v":"Quiz-1"},{"$f":"INDIRECT(\"\"&AL15&\"!\"&$W$1&$T$4)","v":0},{"$f":"INDIRECT(\"\"&AL15&\"!\"&$X$1&$T17)","v":0},{"$f":"INDIRECT(\"\"&AL15&\"!\"&$Y$1&$T17)","v":0},{"$f":"INDIRECT(\"\"&AL15&\"!\"&$Z$1&$T17)","v":1},{"$f":"INDIRECT(\"\"&AL15&\"!\"&$AA$1&$T17)","v":0},{"$f":"INDIRECT(\"\"&AL15&\"!\"&$AB$1&$T17)","v":0},{"$f":"INDIRECT(\"\"&AL15&\"!\"&$AC$1&$T17)","v":0},{"$f":"INDIRECT(\"\"&AL15&\"!\"&$AD$1&$T17)","v":0},{"$f":"INDIRECT(\"\"&AL15&\"!\"&$AE$1&$T17)","v":0},{"$f":"INDIRECT(\"\"&AL15&\"!\"&$AF$1&$T17)","v":0},{"$f":"IF(AT17>5,1,0)","v":0},{"$f":"IF(AU17>2,1,0)","v":0},{"$f":"INDIRECT(\"\"&$W$2&\"!\"&$AI$1&$T17)","v":" "},null,{"$f":"INDIRECT(\"\"&BA15&\"!\"&$V$1&$T17)","v":"Quiz-1"},{"$f":"INDIRECT(\"\"&BA15&\"!\"&$W$1&$T$4)","v":0},{"$f":"INDIRECT(\"\"&BA15&\"!\"&$X$1&$T17)","v":0},{"$f":"INDIRECT(\"\"&BA15&\"!\"&$Y$1&$T17)","v":0},{"$f":"INDIRECT(\"\"&BA15&\"!\"&$Z$1&$T17)","v":1},{"$f":"INDIRECT(\"\"&BA15&\"!\"&$AA$1&$T17)","v":0},{"$f":"INDIRECT(\"\"&BA15&\"!\"&$AB$1&$T17)","v":0},{"$f":"INDIRECT(\"\"&BA15&\"!\"&$AC$1&$T17)","v":0},{"$f":"INDIRECT(\"\"&BA15&\"!\"&$AD$1&$T17)","v":0},{"$f":"INDIRECT(\"\"&BA15&\"!\"&$AE$1&$T17)","v":0},{"$f":"INDIRECT(\"\"&BA15&\"!\"&$AF$1&$T17)","v":0},{"$f":"IF(BI17>5,1,0)","v":0},{"$f":"IF(BJ17>2,1,0)","v":0},{"$f":"INDIRECT(\"\"&$W$2&\"!\"&$AI$1&$T17)","v":" "},null,{"$f":"INDIRECT(\"\"&BP15&\"!\"&$V$1&$T17)","v":"Quiz-1"},{"$f":"INDIRECT(\"\"&BP15&\"!\"&$W$1&$T$4)","v":0},{"$f":"INDIRECT(\"\"&BP15&\"!\"&$X$1&$T17)","v":0},{"$f":"INDIRECT(\"\"&BP15&\"!\"&$Y$1&$T17)","v":0},{"$f":"INDIRECT(\"\"&BP15&\"!\"&$Z$1&$T17)","v":1},{"$f":"INDIRECT(\"\"&BP15&\"!\"&$AA$1&$T17)","v":0},{"$f":"INDIRECT(\"\"&BP15&\"!\"&$AB$1&$T17)","v":0},{"$f":"INDIRECT(\"\"&BP15&\"!\"&$AC$1&$T17)","v":0},{"$f":"INDIRECT(\"\"&BP15&\"!\"&$AD$1&$T17)","v":0},{"$f":"INDIRECT(\"\"&BP15&\"!\"&$AE$1&$T17)","v":0},{"$f":"INDIRECT(\"\"&BP15&\"!\"&$AF$1&$T17)","v":0},{"$f":"IF(BX17>5,1,0)","v":0},{"$f":"IF(BY17>2,1,0)","v":0},{"$f":"INDIRECT(\"\"&$W$2&\"!\"&$AI$1&$T17)","v":" "}]
[null,"Other Team",{"$f":"INDIRECT(\"\"&W2&\"!\"&$W$1&$R$18)","v":0},{"$f":"INDIRECT(\"\"&W15&\"!\"&$W$1&$R$18)","v":0},{"$f":"INDIRECT(\"\"&W15&\"!\"&$W$1&$R$18)","v":0},{"$f":"INDIRECT(\"\"&W28&\"!\"&$W$1&$R$18)","v":0},{"$f":"INDIRECT(\"\"&AL15&\"!\"&$W$1&$R$18)","v":0},{"$f":"INDIRECT(\"\"&AL28&\"!\"&$W$1&$R$18)","v":0},{"$f":"INDIRECT(\"\"&BA2&\"!\"&$W$1&$R$18)","v":0},{"$f":"INDIRECT(\"\"&BA15&\"!\"&$W$1&$R$18)","v":0},{"$f":"INDIRECT(\"\"&BA28&\"!\"&$W$1&$R$18)","v":0},{"$f":"INDIRECT(\"\"&BP2&\"!\"&$W$1&$R$18)","v":0},{"$f":"INDIRECT(\"\"&BP15&\"!\"&$W$1&$R$18)","v":0},{"$f":"INDIRECT(\"\"&BP28&\"!\"&$W$1&$R$18)","v":0},{"$f":"SUM(C18:N18)","v":0},null,null,28,null,9,null,{"$f":"INDIRECT(\"\"&W15&\"!\"&$V$1&$T18)","v":0},{"$f":"INDIRECT(\"\"&$W15&\"!\"&$W$1&$T$5)","v":0},{"$f":"INDIRECT(\"\"&W15&\"!\"&$X$1&$T$5)","v":0},{"$f":"INDIRECT(\"\"&W15&\"!\"&$Y$1&$T$5)","v":0},{"$f":"INDIRECT(\"\"&W15&\"!\"&$Z$1&$T$5)","v":1},{"$f":"INDIRECT(\"\"&W15&\"!\"&$AA$1&$T$5)","v":0},{"$f":"INDIRECT(\"\"&W15&\"!\"&$AB$1&$T$5)","v":0},{"$f":"INDIRECT(\"\"&W15&\"!\"&$AC$1&$T$5)","v":0},{"$f":"INDIRECT(\"\"&W15&\"!\"&$AD$1&$T18)","v":0},{"$f":"INDIRECT(\"\"&W15&\"!\"&$AE$1&$T18)","v":0},{"$f":"INDIRECT(\"\"&W15&\"!\"&$AF$1&$T18)","v":0},{"$f":"IF(AE18>5,1,0)","v":0},{"$f":"IF(AF18>2,1,0)","v":0}," ",null,{"$f":"INDIRECT(\"\"&AL15&\"!\"&$V$1&$T18)","v":0},{"$f":"INDIRECT(\"\"&$W15&\"!\"&$W$1&$T$5)","v":0},{"$f":"INDIRECT(\"\"&AL15&\"!\"&$X$1&$T$5)","v":0},{"$f":"INDIRECT(\"\"&AL15&\"!\"&$Y$1&$T$5)","v":0},{"$f":"INDIRECT(\"\"&AL15&\"!\"&$Z$1&$T$5)","v":1},{"$f":"INDIRECT(\"\"&AL15&\"!\"&$AA$1&$T$5)","v":0},{"$f":"INDIRECT(\"\"&AL15&\"!\"&$AB$1&$T$5)","v":0},{"$f":"INDIRECT(\"\"&AL15&\"!\"&$AC$1&$T$5)","v":0},{"$f":"INDIRECT(\"\"&AL15&\"!\"&$AD$1&$T18)","v":0},{"$f":"INDIRECT(\"\"&AL15&\"!\"&$AE$1&$T18)","v":0},{"$f":"INDIRECT(\"\"&AL15&\"!\"&$AF$1&$T18)","v":0},{"$f":"IF(AT18>5,1,0)","v":0},{"$f":"IF(AU18>2,1,0)","v":0}," ",null,{"$f":"INDIRECT(\"\"&BA15&\"!\"&$V$1&$T18)","v":0},{"$f":"INDIRECT(\"\"&$W15&\"!\"&$W$1&$T$5)","v":0},{"$f":"INDIRECT(\"\"&BA15&\"!\"&$X$1&$T$5)","v":0},{"$f":"INDIRECT(\"\"&BA15&\"!\"&$Y$1&$T$5)","v":0},{"$f":"INDIRECT(\"\"&BA15&\"!\"&$Z$1&$T$5)","v":1},{"$f":"INDIRECT(\"\"&BA15&\"!\"&$AA$1&$T$5)","v":0},{"$f":"INDIRECT(\"\"&BA15&\"!\"&$AB$1&$T$5)","v":0},{"$f":"INDIRECT(\"\"&BA15&\"!\"&$AC$1&$T$5)","v":0},{"$f":"INDIRECT(\"\"&BA15&\"!\"&$AD$1&$T18)","v":0},{"$f":"INDIRECT(\"\"&BA15&\"!\"&$AE$1&$T18)","v":0},{"$f":"INDIRECT(\"\"&BA15&\"!\"&$AF$1&$T18)","v":0},{"$f":"IF(BI18>5,1,0)","v":0},{"$f":"IF(BJ18>2,1,0)","v":0}," ",null,{"$f":"INDIRECT(\"\"&BP15&\"!\"&$V$1&$T18)","v":0},{"$f":"INDIRECT(\"\"&$W15&\"!\"&$W$1&$T$5)","v":0},{"$f":"INDIRECT(\"\"&BP15&\"!\"&$X$1&$T$5)","v":0},{"$f":"INDIRECT(\"\"&BP15&\"!\"&$Y$1&$T$5)","v":0},{"$f":"INDIRECT(\"\"&BP15&\"!\"&$Z$1&$T$5)","v":1},{"$f":"INDIRECT(\"\"&BP15&\"!\"&$AA$1&$T$5)","v":0},{"$f":"INDIRECT(\"\"&BP15&\"!\"&$AB$1&$T$5)","v":0},{"$f":"INDIRECT(\"\"&BP15&\"!\"&$AC$1&$T$5)","v":0},{"$f":"INDIRECT(\"\"&BP15&\"!\"&$AD$1&$T18)","v":0},{"$f":"INDIRECT(\"\"&BP15&\"!\"&$AE$1&$T18)","v":0},{"$f":"INDIRECT(\"\"&BP15&\"!\"&$AF$1&$T18)","v":0},{"$f":"IF(BX18>5,1,0)","v":0},{"$f":"IF(BY18>2,1,0)","v":0}," "]
[null,null,null,null,null,null,null,null,null,null,null,null,null,null,null,null,null,null,null,10,null,{"$f":"INDIRECT(\"\"&W15&\"!\"&$V$1&$T19)","v":"Quiz-2"},{"$f":"INDIRECT(\"\"&W15&\"!\"&$W$1&$T19)","v":0},{"$f":"INDIRECT(\"\"&W15&\"!\"&$X$1&$T19)","v":0},{"$f":"INDIRECT(\"\"&W15&\"!\"&$Y$1&$T19)","v":0},{"$f":"INDIRECT(\"\"&W15&\"!\"&$Z$1&$T19)","v":1},{"$f":"INDIRECT(\"\"&W15&\"!\"&$AA$1&$T19)","v":0},{"$f":"INDIRECT(\"\"&W15&\"!\"&$AB$1&$T19)","v":0},{"$f":"INDIRECT(\"\"&W15&\"!\"&$AC$1&$T19)","v":0},{"$f":"INDIRECT(\"\"&W15&\"!\"&$AD$1&$T19)","v":0},{"$f":"INDIRECT(\"\"&W15&\"!\"&$AE$1&$T19)","v":0},{"$f":"INDIRECT(\"\"&W15&\"!\"&$AF$1&$T19)","v":0},{"$f":"IF(AE19>5,1,0)","v":0},{"$f":"IF(AF19>2,1,0)","v":0}," ",null,{"$f":"INDIRECT(\"\"&AL15&\"!\"&$V$1&$T19)","v":"Quiz-2"},{"$f":"INDIRECT(\"\"&AL15&\"!\"&$W$1&$T19)","v":0},{"$f":"INDIRECT(\"\"&AL15&\"!\"&$X$1&$T19)","v":0},{"$f":"INDIRECT(\"\"&AL15&\"!\"&$Y$1&$T19)","v":0},{"$f":"INDIRECT(\"\"&AL15&\"!\"&$Z$1&$T19)","v":1},{"$f":"INDIRECT(\"\"&AL15&\"!\"&$AA$1&$T19)","v":0},{"$f":"INDIRECT(\"\"&AL15&\"!\"&$AB$1&$T19)","v":0},{"$f":"INDIRECT(\"\"&AL15&\"!\"&$AC$1&$T19)","v":0},{"$f":"INDIRECT(\"\"&AL15&\"!\"&$AD$1&$T19)","v":0},{"$f":"INDIRECT(\"\"&AL15&\"!\"&$AE$1&$T19)","v":0},{"$f":"INDIRECT(\"\"&AL15&\"!\"&$AF$1&$T19)","v":0},{"$f":"IF(AT19>5,1,0)","v":0},{"$f":"IF(AU19>2,1,0)","v":0}," ",null,{"$f":"INDIRECT(\"\"&BA15&\"!\"&$V$1&$T19)","v":"Quiz-2"},{"$f":"INDIRECT(\"\"&BA15&\"!\"&$W$1&$T19)","v":0},{"$f":"INDIRECT(\"\"&BA15&\"!\"&$X$1&$T19)","v":0},{"$f":"INDIRECT(\"\"&BA15&\"!\"&$Y$1&$T19)","v":0},{"$f":"INDIRECT(\"\"&BA15&\"!\"&$Z$1&$T19)","v":1},{"$f":"INDIRECT(\"\"&BA15&\"!\"&$AA$1&$T19)","v":0},{"$f":"INDIRECT(\"\"&BA15&\"!\"&$AB$1&$T19)","v":0},{"$f":"INDIRECT(\"\"&BA15&\"!\"&$AC$1&$T19)","v":0},{"$f":"INDIRECT(\"\"&BA15&\"!\"&$AD$1&$T19)","v":0},{"$f":"INDIRECT(\"\"&BA15&\"!\"&$AE$1&$T19)","v":0},{"$f":"INDIRECT(\"\"&BA15&\"!\"&$AF$1&$T19)","v":0},{"$f":"IF(BI19>5,1,0)","v":0},{"$f":"IF(BJ19>2,1,0)","v":0}," ",null,{"$f":"INDIRECT(\"\"&BP15&\"!\"&$V$1&$T19)","v":"Quiz-2"},{"$f":"INDIRECT(\"\"&BP15&\"!\"&$W$1&$T19)","v":0},{"$f":"INDIRECT(\"\"&BP15&\"!\"&$X$1&$T19)","v":0},{"$f":"INDIRECT(\"\"&BP15&\"!\"&$Y$1&$T19)","v":0},{"$f":"INDIRECT(\"\"&BP15&\"!\"&$Z$1&$T19)","v":1},{"$f":"INDIRECT(\"\"&BP15&\"!\"&$AA$1&$T19)","v":0},{"$f":"INDIRECT(\"\"&BP15&\"!\"&$AB$1&$T19)","v":0},{"$f":"INDIRECT(\"\"&BP15&\"!\"&$AC$1&$T19)","v":0},{"$f":"INDIRECT(\"\"&BP15&\"!\"&$AD$1&$T19)","v":0},{"$f":"INDIRECT(\"\"&BP15&\"!\"&$AE$1&$T19)","v":0},{"$f":"INDIRECT(\"\"&BP15&\"!\"&$AF$1&$T19)","v":0},{"$f":"IF(BX19>5,1,0)","v":0},{"$f":"IF(BY19>2,1,0)","v":0}," "]
[null,"Difference",{"$f":"C13-C18","v":0},{"$f":"D13-D18","v":0},0,0,0,0,0,0,0,0,{"$f":"M13-M18","v":0},{"$f":"N13-N18","v":0},{"$f":"SUM(C20:N20)","v":0},null,null,null,null,11,null,{"$f":"INDIRECT(\"\"&W15&\"!\"&$V$1&$T20)","v":0},{"$f":"INDIRECT(\"\"&W15&\"!\"&$W$1&$T20)","v":0},{"$f":"INDIRECT(\"\"&W15&\"!\"&$X$1&$T20)","v":0},{"$f":"INDIRECT(\"\"&W15&\"!\"&$Y$1&$T20)","v":0},{"$f":"INDIRECT(\"\"&W15&\"!\"&$Z$1&$T20)","v":1},{"$f":"INDIRECT(\"\"&W15&\"!\"&$AA$1&$T20)","v":0},{"$f":"INDIRECT(\"\"&W15&\"!\"&$AB$1&$T20)","v":0},{"$f":"INDIRECT(\"\"&W15&\"!\"&$AC$1&$T20)","v":0},{"$f":"INDIRECT(\"\"&W15&\"!\"&$AD$1&$T20)","v":0},{"$f":"INDIRECT(\"\"&W15&\"!\"&$AE$1&$T20)","v":0},{"$f":"INDIRECT(\"\"&W15&\"!\"&$AF$1&$T20)","v":0},0,0," ",null,{"$f":"INDIRECT(\"\"&AL15&\"!\"&$V$1&$T20)","v":0},{"$f":"INDIRECT(\"\"&AL15&\"!\"&$W$1&$T20)","v":0},{"$f":"INDIRECT(\"\"&AL15&\"!\"&$X$1&$T20)","v":0},{"$f":"INDIRECT(\"\"&AL15&\"!\"&$Y$1&$T20)","v":0},{"$f":"INDIRECT(\"\"&AL15&\"!\"&$Z$1&$T20)","v":1},{"$f":"INDIRECT(\"\"&AL15&\"!\"&$AA$1&$T20)","v":0},{"$f":"INDIRECT(\"\"&AL15&\"!\"&$AB$1&$T20)","v":0},{"$f":"INDIRECT(\"\"&AL15&\"!\"&$AC$1&$T20)","v":0},{"$f":"INDIRECT(\"\"&AL15&\"!\"&$AD$1&$T20)","v":0},{"$f":"INDIRECT(\"\"&AL15&\"!\"&$AE$1&$T20)","v":0},{"$f":"INDIRECT(\"\"&AL15&\"!\"&$AF$1&$T20)","v":0},0,0," ",null,{"$f":"INDIRECT(\"\"&BA15&\"!\"&$V$1&$T20)","v":0},{"$f":"INDIRECT(\"\"&BA15&\"!\"&$W$1&$T20)","v":0},{"$f":"INDIRECT(\"\"&BA15&\"!\"&$X$1&$T20)","v":0},{"$f":"INDIRECT(\"\"&BA15&\"!\"&$Y$1&$T20)","v":0},{"$f":"INDIRECT(\"\"&BA15&\"!\"&$Z$1&$T20)","v":1},{"$f":"INDIRECT(\"\"&BA15&\"!\"&$AA$1&$T20)","v":0},{"$f":"INDIRECT(\"\"&BA15&\"!\"&$AB$1&$T20)","v":0},{"$f":"INDIRECT(\"\"&BA15&\"!\"&$AC$1&$T20)","v":0},{"$f":"INDIRECT(\"\"&BA15&\"!\"&$AD$1&$T20)","v":0},{"$f":"INDIRECT(\"\"&BA15&\"!\"&$AE$1&$T20)","v":0},{"$f":"INDIRECT(\"\"&BA15&\"!\"&$AF$1&$T20)","v":0},0,0," ",null,{"$f":"INDIRECT(\"\"&BP15&\"!\"&$V$1&$T20)","v":0},{"$f":"INDIRECT(\"\"&BP15&\"!\"&$W$1&$T20)","v":0},{"$f":"INDIRECT(\"\"&BP15&\"!\"&$X$1&$T20)","v":0},{"$f":"INDIRECT(\"\"&BP15&\"!\"&$Y$1&$T20)","v":0},{"$f":"INDIRECT(\"\"&BP15&\"!\"&$Z$1&$T20)","v":1},{"$f":"INDIRECT(\"\"&BP15&\"!\"&$AA$1&$T20)","v":0},{"$f":"INDIRECT(\"\"&BP15&\"!\"&$AB$1&$T20)","v":0},{"$f":"INDIRECT(\"\"&BP15&\"!\"&$AC$1&$T20)","v":0},{"$f":"INDIRECT(\"\"&BP15&\"!\"&$AD$1&$T20)","v":0},{"$f":"INDIRECT(\"\"&BP15&\"!\"&$AE$1&$T20)","v":0},{"$f":"INDIRECT(\"\"&BP15&\"!\"&$AF$1&$T20)","v":0},0,0," "]
[null,null,null,null,null,null,null,null,null,null,null,null,null,null,null,null,null,null,null,12,null,{"$f":"INDIRECT(\"\"&W15&\"!\"&$V$1&$T21)","v":"Quiz-3"},{"$f":"INDIRECT(\"\"&W15&\"!\"&$W$1&$T21)","v":0},{"$f":"INDIRECT(\"\"&W15&\"!\"&$X$1&$T21)","v":0},{"$f":"INDIRECT(\"\"&W15&\"!\"&$Y$1&$T21)","v":0},{"$f":"INDIRECT(\"\"&W15&\"!\"&$Z$1&$T21)","v":1},{"$f":"INDIRECT(\"\"&W15&\"!\"&$AA$1&$T21)","v":0},{"$f":"INDIRECT(\"\"&W15&\"!\"&$AB$1&$T21)","v":0},{"$f":"INDIRECT(\"\"&W15&\"!\"&$AC$1&$T21)","v":0},{"$f":"INDIRECT(\"\"&W15&\"!\"&$AD$1&$T21)","v":0},{"$f":"INDIRECT(\"\"&W15&\"!\"&$AE$1&$T21)","v":0},{"$f":"INDIRECT(\"\"&W15&\"!\"&$AF$1&$T21)","v":0},0,0," ",null,{"$f":"INDIRECT(\"\"&AL15&\"!\"&$V$1&$T21)","v":"Quiz-3"},{"$f":"INDIRECT(\"\"&AL15&\"!\"&$W$1&$T21)","v":0},{"$f":"INDIRECT(\"\"&AL15&\"!\"&$X$1&$T21)","v":0},{"$f":"INDIRECT(\"\"&AL15&\"!\"&$Y$1&$T21)","v":0},{"$f":"INDIRECT(\"\"&AL15&\"!\"&$Z$1&$T21)","v":1},{"$f":"INDIRECT(\"\"&AL15&\"!\"&$AA$1&$T21)","v":0},{"$f":"INDIRECT(\"\"&AL15&\"!\"&$AB$1&$T21)","v":0},{"$f":"INDIRECT(\"\"&AL15&\"!\"&$AC$1&$T21)","v":0},{"$f":"INDIRECT(\"\"&AL15&\"!\"&$AD$1&$T21)","v":0},{"$f":"INDIRECT(\"\"&AL15&\"!\"&$AE$1&$T21)","v":0},{"$f":"INDIRECT(\"\"&AL15&\"!\"&$AF$1&$T21)","v":0},0,0," ",null,{"$f":"INDIRECT(\"\"&BA15&\"!\"&$V$1&$T21)","v":"Quiz-3"},{"$f":"INDIRECT(\"\"&BA15&\"!\"&$W$1&$T21)","v":0},{"$f":"INDIRECT(\"\"&BA15&\"!\"&$X$1&$T21)","v":0},{"$f":"INDIRECT(\"\"&BA15&\"!\"&$Y$1&$T21)","v":0},{"$f":"INDIRECT(\"\"&BA15&\"!\"&$Z$1&$T21)","v":1},{"$f":"INDIRECT(\"\"&BA15&\"!\"&$AA$1&$T21)","v":0},{"$f":"INDIRECT(\"\"&BA15&\"!\"&$AB$1&$T21)","v":0},{"$f":"INDIRECT(\"\"&BA15&\"!\"&$AC$1&$T21)","v":0},{"$f":"INDIRECT(\"\"&BA15&\"!\"&$AD$1&$T21)","v":0},{"$f":"INDIRECT(\"\"&BA15&\"!\"&$AE$1&$T21)","v":0},{"$f":"INDIRECT(\"\"&BA15&\"!\"&$AF$1&$T21)","v":0},0,0," ",null,{"$f":"INDIRECT(\"\"&BP15&\"!\"&$V$1&$T21)","v":"Quiz-3"},{"$f":"INDIRECT(\"\"&BP15&\"!\"&$W$1&$T21)","v":0},{"$f":"INDIRECT(\"\"&BP15&\"!\"&$X$1&$T21)","v":0},{"$f":"INDIRECT(\"\"&BP15&\"!\"&$Y$1&$T21)","v":0},{"$f":"INDIRECT(\"\"&BP15&\"!\"&$Z$1&$T21)","v":1},{"$f":"INDIRECT(\"\"&BP15&\"!\"&$AA$1&$T21)","v":0},{"$f":"INDIRECT(\"\"&BP15&\"!\"&$AB$1&$T21)","v":0},{"$f":"INDIRECT(\"\"&BP15&\"!\"&$AC$1&$T21)","v":0},{"$f":"INDIRECT(\"\"&BP15&\"!\"&$AD$1&$T21)","v":0},{"$f":"INDIRECT(\"\"&BP15&\"!\"&$AE$1&$T21)","v":0},{"$f":"INDIRECT(\"\"&BP15&\"!\"&$AF$1&$T21)","v":0},0,0," "]
[null,null,{"$f":"IF(C20>0,$B$24,IF(C20<0,$B$26,$B$25))","v":"Tie"},{"$f":"IF(D20>0,$B$24,IF(D20<0,$B$26,$B$25))","v":"Tie"},"Tie","Tie","Tie","Tie","Tie","Tie","Tie","Tie","Tie","Tie","Tie",null,null,null,null,13,null,{"$f":"INDIRECT(\"\"&W15&\"!\"&$V$1&$T22)","v":0},{"$f":"INDIRECT(\"\"&W15&\"!\"&$W$1&$T22)","v":0},{"$f":"INDIRECT(\"\"&W15&\"!\"&$X$1&$T22)","v":0},{"$f":"INDIRECT(\"\"&W15&\"!\"&$Y$1&$T22)","v":0},{"$f":"INDIRECT(\"\"&W15&\"!\"&$Z$1&$T22)","v":1},{"$f":"INDIRECT(\"\"&W15&\"!\"&$AA$1&$T22)","v":0},{"$f":"INDIRECT(\"\"&W15&\"!\"&$AB$1&$T22)","v":0},{"$f":"INDIRECT(\"\"&W15&\"!\"&$AC$1&$T22)","v":0},{"$f":"INDIRECT(\"\"&W15&\"!\"&$AD$1&$T22)","v":0},{"$f":"INDIRECT(\"\"&W15&\"!\"&$AE$1&$T22)","v":0},{"$f":"INDIRECT(\"\"&W15&\"!\"&$AF$1&$T22)","v":0},0,0," ",null,{"$f":"INDIRECT(\"\"&AL15&\"!\"&$V$1&$T22)","v":0},{"$f":"INDIRECT(\"\"&AL15&\"!\"&$W$1&$T22)","v":0},{"$f":"INDIRECT(\"\"&AL15&\"!\"&$X$1&$T22)","v":0},{"$f":"INDIRECT(\"\"&AL15&\"!\"&$Y$1&$T22)","v":0},{"$f":"INDIRECT(\"\"&AL15&\"!\"&$Z$1&$T22)","v":1},{"$f":"INDIRECT(\"\"&AL15&\"!\"&$AA$1&$T22)","v":0},{"$f":"INDIRECT(\"\"&AL15&\"!\"&$AB$1&$T22)","v":0},{"$f":"INDIRECT(\"\"&AL15&\"!\"&$AC$1&$T22)","v":0},{"$f":"INDIRECT(\"\"&AL15&\"!\"&$AD$1&$T22)","v":0},{"$f":"INDIRECT(\"\"&AL15&\"!\"&$AE$1&$T22)","v":0},{"$f":"INDIRECT(\"\"&AL15&\"!\"&$AF$1&$T22)","v":0},0,0," ",null,{"$f":"INDIRECT(\"\"&BA15&\"!\"&$V$1&$T22)","v":0},{"$f":"INDIRECT(\"\"&BA15&\"!\"&$W$1&$T22)","v":0},{"$f":"INDIRECT(\"\"&BA15&\"!\"&$X$1&$T22)","v":0},{"$f":"INDIRECT(\"\"&BA15&\"!\"&$Y$1&$T22)","v":0},{"$f":"INDIRECT(\"\"&BA15&\"!\"&$Z$1&$T22)","v":1},{"$f":"INDIRECT(\"\"&BA15&\"!\"&$AA$1&$T22)","v":0},{"$f":"INDIRECT(\"\"&BA15&\"!\"&$AB$1&$T22)","v":0},{"$f":"INDIRECT(\"\"&BA15&\"!\"&$AC$1&$T22)","v":0},{"$f":"INDIRECT(\"\"&BA15&\"!\"&$AD$1&$T22)","v":0},{"$f":"INDIRECT(\"\"&BA15&\"!\"&$AE$1&$T22)","v":0},{"$f":"INDIRECT(\"\"&BA15&\"!\"&$AF$1&$T22)","v":0},0,0," ",null,{"$f":"INDIRECT(\"\"&BP15&\"!\"&$V$1&$T22)","v":0},{"$f":"INDIRECT(\"\"&BP15&\"!\"&$W$1&$T22)","v":0},{"$f":"INDIRECT(\"\"&BP15&\"!\"&$X$1&$T22)","v":0},{"$f":"INDIRECT(\"\"&BP15&\"!\"&$Y$1&$T22)","v":0},{"$f":"INDIRECT(\"\"&BP15&\"!\"&$Z$1&$T22)","v":1},{"$f":"INDIRECT(\"\"&BP15&\"!\"&$AA$1&$T22)","v":0},{"$f":"INDIRECT(\"\"&BP15&\"!\"&$AB$1&$T22)","v":0},{"$f":"INDIRECT(\"\"&BP15&\"!\"&$AC$1&$T22)","v":0},{"$f":"INDIRECT(\"\"&BP15&\"!\"&$AD$1&$T22)","v":0},{"$f":"INDIRECT(\"\"&BP15&\"!\"&$AE$1&$T22)","v":0},{"$f":"INDIRECT(\"\"&BP15&\"!\"&$AF$1&$T22)","v":0},0,0," "]
[null,null,null,null,null,null,null,null,null,null,null,null,null,null,null,null,null,null,null,14,null,{"$f":"INDIRECT(\"\"&W15&\"!\"&$V$1&$T23)","v":"Quiz-4"},{"$f":"INDIRECT(\"\"&W15&\"!\"&$W$1&$T23)","v":0},{"$f":"INDIRECT(\"\"&W15&\"!\"&$X$1&$T23)","v":0},{"$f":"INDIRECT(\"\"&W15&\"!\"&$Y$1&$T23)","v":0},{"$f":"INDIRECT(\"\"&W15&\"!\"&$Z$1&$T23)","v":1},{"$f":"INDIRECT(\"\"&W15&\"!\"&$AA$1&$T23)","v":0},{"$f":"INDIRECT(\"\"&W15&\"!\"&$AB$1&$T23)","v":0},{"$f":"INDIRECT(\"\"&W15&\"!\"&$AC$1&$T23)","v":0},{"$f":"INDIRECT(\"\"&W15&\"!\"&$AD$1&$T23)","v":0},{"$f":"INDIRECT(\"\"&W15&\"!\"&$AE$1&$T23)","v":0},{"$f":"INDIRECT(\"\"&W15&\"!\"&$AF$1&$T23)","v":0},0,0," ",null,{"$f":"INDIRECT(\"\"&AL15&\"!\"&$V$1&$T23)","v":"Quiz-4"},{"$f":"INDIRECT(\"\"&AL15&\"!\"&$W$1&$T23)","v":0},{"$f":"INDIRECT(\"\"&AL15&\"!\"&$X$1&$T23)","v":0},{"$f":"INDIRECT(\"\"&AL15&\"!\"&$Y$1&$T23)","v":0},{"$f":"INDIRECT(\"\"&AL15&\"!\"&$Z$1&$T23)","v":1},{"$f":"INDIRECT(\"\"&AL15&\"!\"&$AA$1&$T23)","v":0},{"$f":"INDIRECT(\"\"&AL15&\"!\"&$AB$1&$T23)","v":0},{"$f":"INDIRECT(\"\"&AL15&\"!\"&$AC$1&$T23)","v":0},{"$f":"INDIRECT(\"\"&AL15&\"!\"&$AD$1&$T23)","v":0},{"$f":"INDIRECT(\"\"&AL15&\"!\"&$AE$1&$T23)","v":0},{"$f":"INDIRECT(\"\"&AL15&\"!\"&$AF$1&$T23)","v":0},0,0," ",null,{"$f":"INDIRECT(\"\"&BA15&\"!\"&$V$1&$T23)","v":"Quiz-4"},{"$f":"INDIRECT(\"\"&BA15&\"!\"&$W$1&$T23)","v":0},{"$f":"INDIRECT(\"\"&BA15&\"!\"&$X$1&$T23)","v":0},{"$f":"INDIRECT(\"\"&BA15&\"!\"&$Y$1&$T23)","v":0},{"$f":"INDIRECT(\"\"&BA15&\"!\"&$Z$1&$T23)","v":1},{"$f":"INDIRECT(\"\"&BA15&\"!\"&$AA$1&$T23)","v":0},{"$f":"INDIRECT(\"\"&BA15&\"!\"&$AB$1&$T23)","v":0},{"$f":"INDIRECT(\"\"&BA15&\"!\"&$AC$1&$T23)","v":0},{"$f":"INDIRECT(\"\"&BA15&\"!\"&$AD$1&$T23)","v":0},{"$f":"INDIRECT(\"\"&BA15&\"!\"&$AE$1&$T23)","v":0},{"$f":"INDIRECT(\"\"&BA15&\"!\"&$AF$1&$T23)","v":0},0,0," ",null,{"$f":"INDIRECT(\"\"&BP15&\"!\"&$V$1&$T23)","v":"Quiz-4"},{"$f":"INDIRECT(\"\"&BP15&\"!\"&$W$1&$T23)","v":0},{"$f":"INDIRECT(\"\"&BP15&\"!\"&$X$1&$T23)","v":0},{"$f":"INDIRECT(\"\"&BP15&\"!\"&$Y$1&$T23)","v":0},{"$f":"INDIRECT(\"\"&BP15&\"!\"&$Z$1&$T23)","v":1},{"$f":"INDIRECT(\"\"&BP15&\"!\"&$AA$1&$T23)","v":0},{"$f":"INDIRECT(\"\"&BP15&\"!\"&$AB$1&$T23)","v":0},{"$f":"INDIRECT(\"\"&BP15&\"!\"&$AC$1&$T23)","v":0},{"$f":"INDIRECT(\"\"&BP15&\"!\"&$AD$1&$T23)","v":0},{"$f":"INDIRECT(\"\"&BP15&\"!\"&$AE$1&$T23)","v":0},{"$f":"INDIRECT(\"\"&BP15&\"!\"&$AF$1&$T23)","v":0},0,0," "]
[null,"Win",{"$f":"IF(C20>0,1,0)","v":0},{"$f":"IF(D20>0,1,0)","v":0},0,0,0,0,0,0,0,0,{"$f":"IF(M20>0,1,0)","v":0},{"$f":"IF(N20>0,1,0)","v":0},{"$f":"SUM(C24:N24)","v":0},null,null,null,null,15,null,{"$f":"INDIRECT(\"\"&W15&\"!\"&$V$1&$T24)","v":0},{"$f":"INDIRECT(\"\"&W15&\"!\"&$W$1&$T24)","v":0},{"$f":"INDIRECT(\"\"&W15&\"!\"&$X$1&$T24)","v":0},{"$f":"INDIRECT(\"\"&W15&\"!\"&$Y$1&$T24)","v":0},{"$f":"INDIRECT(\"\"&W15&\"!\"&$Z$1&$T24)","v":1},{"$f":"INDIRECT(\"\"&W15&\"!\"&$AA$1&$T24)","v":0},{"$f":"INDIRECT(\"\"&W15&\"!\"&$AB$1&$T24)","v":0},{"$f":"INDIRECT(\"\"&W15&\"!\"&$AC$1&$T24)","v":0},{"$f":"INDIRECT(\"\"&W15&\"!\"&$AD$1&$T24)","v":0},{"$f":"INDIRECT(\"\"&W15&\"!\"&$AE$1&$T24)","v":0},{"$f":"INDIRECT(\"\"&W15&\"!\"&$AF$1&$T24)","v":0},0,0," ",null,{"$f":"INDIRECT(\"\"&AL15&\"!\"&$V$1&$T24)","v":0},{"$f":"INDIRECT(\"\"&AL15&\"!\"&$W$1&$T24)","v":0},{"$f":"INDIRECT(\"\"&AL15&\"!\"&$X$1&$T24)","v":0},{"$f":"INDIRECT(\"\"&AL15&\"!\"&$Y$1&$T24)","v":0},{"$f":"INDIRECT(\"\"&AL15&\"!\"&$Z$1&$T24)","v":1},{"$f":"INDIRECT(\"\"&AL15&\"!\"&$AA$1&$T24)","v":0},{"$f":"INDIRECT(\"\"&AL15&\"!\"&$AB$1&$T24)","v":0},{"$f":"INDIRECT(\"\"&AL15&\"!\"&$AC$1&$T24)","v":0},{"$f":"INDIRECT(\"\"&AL15&\"!\"&$AD$1&$T24)","v":0},{"$f":"INDIRECT(\"\"&AL15&\"!\"&$AE$1&$T24)","v":0},{"$f":"INDIRECT(\"\"&AL15&\"!\"&$AF$1&$T24)","v":0},0,0," ",null,{"$f":"INDIRECT(\"\"&BA15&\"!\"&$V$1&$T24)","v":0},{"$f":"INDIRECT(\"\"&BA15&\"!\"&$W$1&$T24)","v":0},{"$f":"INDIRECT(\"\"&BA15&\"!\"&$X$1&$T24)","v":0},{"$f":"INDIRECT(\"\"&BA15&\"!\"&$Y$1&$T24)","v":0},{"$f":"INDIRECT(\"\"&BA15&\"!\"&$Z$1&$T24)","v":1},{"$f":"INDIRECT(\"\"&BA15&\"!\"&$AA$1&$T24)","v":0},{"$f":"INDIRECT(\"\"&BA15&\"!\"&$AB$1&$T24)","v":0},{"$f":"INDIRECT(\"\"&BA15&\"!\"&$AC$1&$T24)","v":0},{"$f":"INDIRECT(\"\"&BA15&\"!\"&$AD$1&$T24)","v":0},{"$f":"INDIRECT(\"\"&BA15&\"!\"&$AE$1&$T24)","v":0},{"$f":"INDIRECT(\"\"&BA15&\"!\"&$AF$1&$T24)","v":0},0,0," ",null,{"$f":"INDIRECT(\"\"&BP15&\"!\"&$V$1&$T24)","v":0},{"$f":"INDIRECT(\"\"&BP15&\"!\"&$W$1&$T24)","v":0},{"$f":"INDIRECT(\"\"&BP15&\"!\"&$X$1&$T24)","v":0},{"$f":"INDIRECT(\"\"&BP15&\"!\"&$Y$1&$T24)","v":0},{"$f":"INDIRECT(\"\"&BP15&\"!\"&$Z$1&$T24)","v":1},{"$f":"INDIRECT(\"\"&BP15&\"!\"&$AA$1&$T24)","v":0},{"$f":"INDIRECT(\"\"&BP15&\"!\"&$AB$1&$T24)","v":0},{"$f":"INDIRECT(\"\"&BP15&\"!\"&$AC$1&$T24)","v":0},{"$f":"INDIRECT(\"\"&BP15&\"!\"&$AD$1&$T24)","v":0},{"$f":"INDIRECT(\"\"&BP15&\"!\"&$AE$1&$T24)","v":0},{"$f":"INDIRECT(\"\"&BP15&\"!\"&$AF$1&$T24)","v":0},0,0," "]
[null,"Tie",{"$f":"IF(C20=0,1,0)","v":1},{"$f":"IF(D20=0,1,0)","v":1},1,1,1,1,1,1,1,1,{"$f":"IF(M20=0,1,0)","v":1},{"$f":"IF(N20=0,1,0)","v":1},{"$f":"SUM(C25:N25)","v":12},null,null,null,null,16,null,{"$f":"INDIRECT(\"\"&W15&\"!\"&$V$1&$T25)","v":"Team Fouls"},{"$f":"INDIRECT(\"\"&W15&\"!\"&$W$1&$T25)","v":0},null,null,null,null,null,null,null,null,null,null,null,null,null,{"$f":"INDIRECT(\"\"&AL15&\"!\"&$V$1&$T25)","v":"Team Fouls"},{"$f":"INDIRECT(\"\"&AL15&\"!\"&$W$1&$T25)","v":0},null,null,null,null,null,null,null,null,null,null,null,null,null,{"$f":"INDIRECT(\"\"&BA15&\"!\"&$V$1&$T25)","v":"Team Fouls"},{"$f":"INDIRECT(\"\"&BA15&\"!\"&$W$1&$T25)","v":0},null,null,null,null,null,null,null,null,null,null,null,null,null,{"$f":"INDIRECT(\"\"&BP15&\"!\"&$V$1&$T25)","v":"Team Fouls"},{"$f":"INDIRECT(\"\"&BP15&\"!\"&$W$1&$T25)","v":0}]
[null,"Loss",{"$f":"IF(C20<0,1,0)","v":0},{"$f":"IF(D20<0,1,0)","v":0},0,0,0,0,0,0,0,0,{"$f":"IF(M20<0,1,0)","v":0},{"$f":"IF(N20<0,1,0)","v":0},{"$f":"SUM(C26:N26)","v":0},null,null,null,null,19,null,"Total",{"$f":"SUM(W17:W25)","v":0},{"$f":"SUM(X17:X24)","v":0},{"$f":"SUM(Y17:Y24)","v":0},{"$f":"SUM(Z17:Z24)","v":8},null,{"$f":"SUM(AB17:AB24)","v":0},0,0,0,0,0,{"$f":"SUM(AH17:AH24)","v":0},null,null,"Total",{"$f":"SUM(AL17:AL25)","v":0},{"$f":"SUM(AM17:AM24)","v":0},{"$f":"SUM(AN17:AN24)","v":0},{"$f":"SUM(AO17:AO24)","v":8},null,{"$f":"SUM(AQ17:AQ24)","v":0},0,0,0,0,0,{"$f":"SUM(AW17:AW24)","v":0},null,null,"Total",{"$f":"SUM(BA17:BA25)","v":0},{"$f":"SUM(BB17:BB24)","v":0},{"$f":"SUM(BC17:BC24)","v":0},{"$f":"SUM(BD17:BD24)","v":8},null,{"$f":"SUM(BF17:BF24)","v":0},0,0,0,0,0,{"$f":"SUM(BL17:BL24)","v":0},null,null,"Total",{"$f":"SUM(BP17:BP25)","v":0},{"$f":"SUM(BQ17:BQ24)","v":0},{"$f":"SUM(BR17:BR24)","v":0},{"$f":"SUM(BS17:BS24)","v":8},null,{"$f":"SUM(BU17:BU24)","v":0},0,0,0,0,0,{"$f":"SUM(CA17:CA24)","v":0}]
[null,null,null,null,null,null,null,null,null,null,null,null,null,null,null,null,null,null,null,28,null,{"$f":"INDIRECT(\"\"&$W15&\"!\"&$V$1&$T26)","v":"Green Team"},{"$f":"INDIRECT(\"\"&$W15&\"!\"&$W$1&$T27)","v":0},null,null,null,null,null,null,null,null,null,null,null,null,null,{"$f":"INDIRECT(\"\"&$AL15&\"!\"&$V$1&$T26)","v":"Green Team"},{"$f":"INDIRECT(\"\"&$AL15&\"!\"&$W$1&$T27)","v":0},null,null,null,null,null,null,null,null,null,null,null,null,null,{"$f":"INDIRECT(\"\"&$BA15&\"!\"&$V$1&$T26)","v":"Green Team"},{"$f":"INDIRECT(\"\"&$BA15&\"!\"&$W$1&$T27)","v":0},null,null,null,null,null,null,null,null,null,null,null,null,null,{"$f":"INDIRECT(\"\"&$BP15&\"!\"&$V$1&$T26)","v":"Green Team"},{"$f":"INDIRECT(\"\"&$BP15&\"!\"&$W$1&$T27)","v":0}]
[null,null,null,null,null,null,null,null,null,null,null,null,null,null,null,null,null,null,null,null,null,3,"R_3",null,null,null,null,null,null,null,null,null,null,null,null,null,6,"R_6",null,null,null,null,null,null,null,null,null,null,null,null,null,9,"R_9",null,null,null,null,null,null,null,null,null,null,null,null,null,12,"R_12"]
[null,{"$f":"V3","v":"Red Team"},"Total","Ok's","No's",null,"10's","20's","30's","-5'S","-10'S","-15'S","Q-O","B-O",null,null,null,null,null,7,null,{"$f":"INDIRECT(\"\"&$W$2&\"!$B\"&$T29)","v":"Red Team"},"Total","Ok's","No's","Rank","10's","20's","30's","-5'S","-10'S","-15'S","Qo","Bo","Quiz-Out",null,{"$f":"INDIRECT(\"\"&$W$2&\"!$B\"&$T29)","v":"Red Team"},"Total","Ok's","No's","Rank","10's","20's","30's","-5'S","-10'S","-15'S","Qo","Bo","Quiz-Out",null,{"$f":"INDIRECT(\"\"&$W$2&\"!$B\"&$T29)","v":"Red Team"},"Total","Ok's","No's","Rank","10's","20's","30's","-5'S","-10'S","-15'S","Qo","Bo","Quiz-Out",null,{"$f":"INDIRECT(\"\"&$W$2&\"!$B\"&$T29)","v":"Red Team"},"Total","Ok's","No's","Rank","10's","20's","30's","-5'S","-10'S","-15'S","Qo","Bo","Quiz-Out"]
[null,{"$f":"V4","v":"Quiz-1"},{"$f":"W4+W17+W30+AL4+AL17+AL30+BA4+BA17+BA30+BP4+BP17+BP30","v":0},{"$f":"X4+X17+X30+AM4+AM17+AM30+BB4+BB17+BB30+BQ4+BQ17+BQ30","v":0},{"$f":"Y4+Y17+Y30+AN4+AN17+AN30+BC4+BC17+BC30+BR4+BR17+BR30","v":0},null,{"$f":"AA4+AA17+AA30+AP4+AP17+AP30+BE4+BE17+BE30+BT4+BT17+BT30","v":0},0,0,0,0,0,0,0,null,null,null,null,null,8,null,{"$f":"INDIRECT(\"\"&W28&\"!\"&$V$1&$T30)","v":"Quiz-1"},{"$f":"INDIRECT(\"\"&W28&\"!\"&$W$1&$T$4)","v":0},{"$f":"INDIRECT(\"\"&W28&\"!\"&$X$1&$T30)","v":0},{"$f":"INDIRECT(\"\"&W28&\"!\"&$Y$1&$T30)","v":0},{"$f":"INDIRECT(\"\"&W28&\"!\"&$Z$1&$T30)","v":1},{"$f":"INDIRECT(\"\"&W28&\"!\"&$AA$1&$T30)","v":0},{"$f":"INDIRECT(\"\"&W28&\"!\"&$AB$1&$T30)","v":0},{"$f":"INDIRECT(\"\"&W28&\"!\"&$AC$1&$T30)","v":0},{"$f":"INDIRECT(\"\"&W28&\"!\"&$AD$1&$T30)","v":0},{"$f":"INDIRECT(\"\"&W28&\"!\"&$AE$1&$T30)","v":0},{"$f":"INDIRECT(\"\"&W28&\"!\"&$AF$1&$T30)","v":0},{"$f":"IF(AE30>5,1,0)","v":0},{"$f":"IF(AF30>2,1,0)","v":0},{"$f":"INDIRECT(\"\"&$W$2&\"!\"&$AI$1&$T30)","v":" "},null,{"$f":"INDIRECT(\"\"&AL28&\"!\"&$V$1&$T30)","v":"Quiz-1"},{"$f":"INDIRECT(\"\"&AL28&\"!\"&$W$1&$T$4)","v":0},{"$f":"INDIRECT(\"\"&AL28&\"!\"&$X$1&$T30)","v":0},{"$f":"INDIRECT(\"\"&AL28&\"!\"&$Y$1&$T30)","v":0},{"$f":"INDIRECT(\"\"&AL28&\"!\"&$Z$1&$T30)","v":1},{"$f":"INDIRECT(\"\"&AL28&\"!\"&$AA$1&$T30)","v":0},{"$f":"INDIRECT(\"\"&AL28&\"!\"&$AB$1&$T30)","v":0},{"$f":"INDIRECT(\"\"&AL28&\"!\"&$AC$1&$T30)","v":0},{"$f":"INDIRECT(\"\"&AL28&\"!\"&$AD$1&$T30)","v":0},{"$f":"INDIRECT(\"\"&AL28&\"!\"&$AE$1&$T30)","v":0},{"$f":"INDIRECT(\"\"&AL28&\"!\"&$AF$1&$T30)","v":0},{"$f":"IF(AT30>5,1,0)","v":0},{"$f":"IF(AU30>2,1,0)","v":0},{"$f":"INDIRECT(\"\"&$W$2&\"!\"&$AI$1&$T30)","v":" "},null,{"$f":"INDIRECT(\"\"&BA28&\"!\"&$V$1&$T30)","v":"Quiz-1"},{"$f":"INDIRECT(\"\"&BA28&\"!\"&$W$1&$T$4)","v":0},{"$f":"INDIRECT(\"\"&BA28&\"!\"&$X$1&$T30)","v":0},{"$f":"INDIRECT(\"\"&BA28&\"!\"&$Y$1&$T30)","v":0},{"$f":"INDIRECT(\"\"&BA28&\"!\"&$Z$1&$T30)","v":1},{"$f":"INDIRECT(\"\"&BA28&\"!\"&$AA$1&$T30)","v":0},{"$f":"INDIRECT(\"\"&BA28&\"!\"&$AB$1&$T30)","v":0},{"$f":"INDIRECT(\"\"&BA28&\"!\"&$AC$1&$T30)","v":0},{"$f":"INDIRECT(\"\"&BA28&\"!\"&$AD$1&$T30)","v":0},{"$f":"INDIRECT(\"\"&BA28&\"!\"&$AE$1&$T30)","v":0},{"$f":"INDIRECT(\"\"&BA28&\"!\"&$AF$1&$T30)","v":0},{"$f":"IF(BI30>5,1,0)","v":0},{"$f":"IF(BJ30>2,1,0)","v":0},{"$f":"INDIRECT(\"\"&$W$2&\"!\"&$AI$1&$T30)","v":" "},null,{"$f":"INDIRECT(\"\"&BP28&\"!\"&$V$1&$T30)","v":"Quiz-1"},{"$f":"INDIRECT(\"\"&BP28&\"!\"&$W$1&$T$4)","v":0},{"$f":"INDIRECT(\"\"&BP28&\"!\"&$X$1&$T30)","v":0},{"$f":"INDIRECT(\"\"&BP28&\"!\"&$Y$1&$T30)","v":0},{"$f":"INDIRECT(\"\"&BP28&\"!\"&$Z$1&$T30)","v":1},{"$f":"INDIRECT(\"\"&BP28&\"!\"&$AA$1&$T30)","v":0},{"$f":"INDIRECT(\"\"&BP28&\"!\"&$AB$1&$T30)","v":0},{"$f":"INDIRECT(\"\"&BP28&\"!\"&$AC$1&$T30)","v":0},{"$f":"INDIRECT(\"\"&BP28&\"!\"&$AD$1&$T30)","v":0},{"$f":"INDIRECT(\"\"&BP28&\"!\"&$AE$1&$T30)","v":0},{"$f":"INDIRECT(\"\"&BP28&\"!\"&$AF$1&$T30)","v":0},{"$f":"IF(BX30>5,1,0)","v":0},{"$f":"IF(BY30>2,1,0)","v":0},{"$f":"INDIRECT(\"\"&$W$2&\"!\"&$AI$1&$T30)","v":" "}]
[null,0,0,0,0,null,{"$f":"AA5+AA18+AA31+AP5+AP18+AP31+BE5+BE18+BE31+BT5+BT18+BT31","v":0},0,0,0,0,0,0,0,null,null,null,null,null,9,null,{"$f":"INDIRECT(\"\"&W28&\"!\"&$V$1&$T31)","v":0},{"$f":"INDIRECT(\"\"&$W28&\"!\"&$W$1&$T$5)","v":0},{"$f":"INDIRECT(\"\"&W28&\"!\"&$X$1&$T$5)","v":0},{"$f":"INDIRECT(\"\"&W28&\"!\"&$Y$1&$T$5)","v":0},{"$f":"INDIRECT(\"\"&W28&\"!\"&$Z$1&$T$5)","v":1},{"$f":"INDIRECT(\"\"&W28&\"!\"&$AA$1&$T$5)","v":0},{"$f":"INDIRECT(\"\"&W28&\"!\"&$AB$1&$T$5)","v":0},{"$f":"INDIRECT(\"\"&W28&\"!\"&$AC$1&$T$5)","v":0},{"$f":"INDIRECT(\"\"&W28&\"!\"&$AD$1&$T31)","v":0},{"$f":"INDIRECT(\"\"&W28&\"!\"&$AE$1&$T31)","v":0},{"$f":"INDIRECT(\"\"&W28&\"!\"&$AF$1&$T31)","v":0},{"$f":"IF(AE31>5,1,0)","v":0},{"$f":"IF(AF31>2,1,0)","v":0}," ",null,{"$f":"INDIRECT(\"\"&AL28&\"!\"&$V$1&$T31)","v":0},{"$f":"INDIRECT(\"\"&$W28&\"!\"&$W$1&$T$5)","v":0},{"$f":"INDIRECT(\"\"&AL28&\"!\"&$X$1&$T$5)","v":0},{"$f":"INDIRECT(\"\"&AL28&\"!\"&$Y$1&$T$5)","v":0},{"$f":"INDIRECT(\"\"&AL28&\"!\"&$Z$1&$T$5)","v":1},{"$f":"INDIRECT(\"\"&AL28&\"!\"&$AA$1&$T$5)","v":0},{"$f":"INDIRECT(\"\"&AL28&\"!\"&$AB$1&$T$5)","v":0},{"$f":"INDIRECT(\"\"&AL28&\"!\"&$AC$1&$T$5)","v":0},{"$f":"INDIRECT(\"\"&AL28&\"!\"&$AD$1&$T31)","v":0},{"$f":"INDIRECT(\"\"&AL28&\"!\"&$AE$1&$T31)","v":0},{"$f":"INDIRECT(\"\"&AL28&\"!\"&$AF$1&$T31)","v":0},{"$f":"IF(AT31>5,1,0)","v":0},{"$f":"IF(AU31>2,1,0)","v":0}," ",null,{"$f":"INDIRECT(\"\"&BA28&\"!\"&$V$1&$T31)","v":0},{"$f":"INDIRECT(\"\"&$W28&\"!\"&$W$1&$T$5)","v":0},{"$f":"INDIRECT(\"\"&BA28&\"!\"&$X$1&$T$5)","v":0},{"$f":"INDIRECT(\"\"&BA28&\"!\"&$Y$1&$T$5)","v":0},{"$f":"INDIRECT(\"\"&BA28&\"!\"&$Z$1&$T$5)","v":1},{"$f":"INDIRECT(\"\"&BA28&\"!\"&$AA$1&$T$5)","v":0},{"$f":"INDIRECT(\"\"&BA28&\"!\"&$AB$1&$T$5)","v":0},{"$f":"INDIRECT(\"\"&BA28&\"!\"&$AC$1&$T$5)","v":0},{"$f":"INDIRECT(\"\"&BA28&\"!\"&$AD$1&$T31)","v":0},{"$f":"INDIRECT(\"\"&BA28&\"!\"&$AE$1&$T31)","v":0},{"$f":"INDIRECT(\"\"&BA28&\"!\"&$AF$1&$T31)","v":0},{"$f":"IF(BI31>5,1,0)","v":0},{"$f":"IF(BJ31>2,1,0)","v":0}," ",null,{"$f":"INDIRECT(\"\"&BP28&\"!\"&$V$1&$T31)","v":0},{"$f":"INDIRECT(\"\"&$W28&\"!\"&$W$1&$T$5)","v":0},{"$f":"INDIRECT(\"\"&BP28&\"!\"&$X$1&$T$5)","v":0},{"$f":"INDIRECT(\"\"&BP28&\"!\"&$Y$1&$T$5)","v":0},{"$f":"INDIRECT(\"\"&BP28&\"!\"&$Z$1&$T$5)","v":1},{"$f":"INDIRECT(\"\"&BP28&\"!\"&$AA$1&$T$5)","v":0},{"$f":"INDIRECT(\"\"&BP28&\"!\"&$AB$1&$T$5)","v":0},{"$f":"INDIRECT(\"\"&BP28&\"!\"&$AC$1&$T$5)","v":0},{"$f":"INDIRECT(\"\"&BP28&\"!\"&$AD$1&$T31)","v":0},{"$f":"INDIRECT(\"\"&BP28&\"!\"&$AE$1&$T31)","v":0},{"$f":"INDIRECT(\"\"&BP28&\"!\"&$AF$1&$T31)","v":0},{"$f":"IF(BX31>5,1,0)","v":0},{"$f":"IF(BY31>2,1,0)","v":0}," "]
[null,"Quiz-2",0,0,0,null,{"$f":"AA6+AA19+AA32+AP6+AP19+AP32+BE6+BE19+BE32+BT6+BT19+BT32","v":0},0,0,0,0,0,0,0,null,null,null,null,null,10,null,{"$f":"INDIRECT(\"\"&W28&\"!\"&$V$1&$T32)","v":"Quiz-2"},{"$f":"INDIRECT(\"\"&W28&\"!\"&$W$1&$T32)","v":0},{"$f":"INDIRECT(\"\"&W28&\"!\"&$X$1&$T32)","v":0},{"$f":"INDIRECT(\"\"&W28&\"!\"&$Y$1&$T32)","v":0},{"$f":"INDIRECT(\"\"&W28&\"!\"&$Z$1&$T32)","v":1},{"$f":"INDIRECT(\"\"&W28&\"!\"&$AA$1&$T32)","v":0},{"$f":"INDIRECT(\"\"&W28&\"!\"&$AB$1&$T32)","v":0},{"$f":"INDIRECT(\"\"&W28&\"!\"&$AC$1&$T32)","v":0},{"$f":"INDIRECT(\"\"&W28&\"!\"&$AD$1&$T32)","v":0},{"$f":"INDIRECT(\"\"&W28&\"!\"&$AE$1&$T32)","v":0},{"$f":"INDIRECT(\"\"&W28&\"!\"&$AF$1&$T32)","v":0},{"$f":"IF(AE32>5,1,0)","v":0},{"$f":"IF(AF32>2,1,0)","v":0}," ",null,{"$f":"INDIRECT(\"\"&AL28&\"!\"&$V$1&$T32)","v":"Quiz-2"},{"$f":"INDIRECT(\"\"&AL28&\"!\"&$W$1&$T32)","v":0},{"$f":"INDIRECT(\"\"&AL28&\"!\"&$X$1&$T32)","v":0},{"$f":"INDIRECT(\"\"&AL28&\"!\"&$Y$1&$T32)","v":0},{"$f":"INDIRECT(\"\"&AL28&\"!\"&$Z$1&$T32)","v":1},{"$f":"INDIRECT(\"\"&AL28&\"!\"&$AA$1&$T32)","v":0},{"$f":"INDIRECT(\"\"&AL28&\"!\"&$AB$1&$T32)","v":0},{"$f":"INDIRECT(\"\"&AL28&\"!\"&$AC$1&$T32)","v":0},{"$f":"INDIRECT(\"\"&AL28&\"!\"&$AD$1&$T32)","v":0},{"$f":"INDIRECT(\"\"&AL28&\"!\"&$AE$1&$T32)","v":0},{"$f":"INDIRECT(\"\"&AL28&\"!\"&$AF$1&$T32)","v":0},{"$f":"IF(AT32>5,1,0)","v":0},{"$f":"IF(AU32>2,1,0)","v":0}," ",null,{"$f":"INDIRECT(\"\"&BA28&\"!\"&$V$1&$T32)","v":"Quiz-2"},{"$f":"INDIRECT(\"\"&BA28&\"!\"&$W$1&$T32)","v":0},{"$f":"INDIRECT(\"\"&BA28&\"!\"&$X$1&$T32)","v":0},{"$f":"INDIRECT(\"\"&BA28&\"!\"&$Y$1&$T32)","v":0},{"$f":"INDIRECT(\"\"&BA28&\"!\"&$Z$1&$T32)","v":1},{"$f":"INDIRECT(\"\"&BA28&\"!\"&$AA$1&$T32)","v":0},{"$f":"INDIRECT(\"\"&BA28&\"!\"&$AB$1&$T32)","v":0},{"$f":"INDIRECT(\"\"&BA28&\"!\"&$AC$1&$T32)","v":0},{"$f":"INDIRECT(\"\"&BA28&\"!\"&$AD$1&$T32)","v":0},{"$f":"INDIRECT(\"\"&BA28&\"!\"&$AE$1&$T32)","v":0},{"$f":"INDIRECT(\"\"&BA28&\"!\"&$AF$1&$T32)","v":0},{"$f":"IF(BI32>5,1,0)","v":0},{"$f":"IF(BJ32>2,1,0)","v":0}," ",null,{"$f":"INDIRECT(\"\"&BP28&\"!\"&$V$1&$T32)","v":"Quiz-2"},{"$f":"INDIRECT(\"\"&BP28&\"!\"&$W$1&$T32)","v":0},{"$f":"INDIRECT(\"\"&BP28&\"!\"&$X$1&$T32)","v":0},{"$f":"INDIRECT(\"\"&BP28&\"!\"&$Y$1&$T32)","v":0},{"$f":"INDIRECT(\"\"&BP28&\"!\"&$Z$1&$T32)","v":1},{"$f":"INDIRECT(\"\"&BP28&\"!\"&$AA$1&$T32)","v":0},{"$f":"INDIRECT(\"\"&BP28&\"!\"&$AB$1&$T32)","v":0},{"$f":"INDIRECT(\"\"&BP28&\"!\"&$AC$1&$T32)","v":0},{"$f":"INDIRECT(\"\"&BP28&\"!\"&$AD$1&$T32)","v":0},{"$f":"INDIRECT(\"\"&BP28&\"!\"&$AE$1&$T32)","v":0},{"$f":"INDIRECT(\"\"&BP28&\"!\"&$AF$1&$T32)","v":0},{"$f":"IF(BX32>5,1,0)","v":0},{"$f":"IF(BY32>2,1,0)","v":0}," "]
[null,0,0,0,0,null,{"$f":"AA7+AA20+AA33+AP7+AP20+AP33+BE7+BE20+BE33+BT7+BT20+BT33","v":0},0,0,0,0,0,0,0,null,null,null,null,null,11,null,{"$f":"INDIRECT(\"\"&W28&\"!\"&$V$1&$T33)","v":0},{"$f":"INDIRECT(\"\"&W28&\"!\"&$W$1&$T33)","v":0},{"$f":"INDIRECT(\"\"&W28&\"!\"&$X$1&$T33)","v":0},{"$f":"INDIRECT(\"\"&W28&\"!\"&$Y$1&$T33)","v":0},{"$f":"INDIRECT(\"\"&W28&\"!\"&$Z$1&$T33)","v":1},{"$f":"INDIRECT(\"\"&W28&\"!\"&$AA$1&$T33)","v":0},{"$f":"INDIRECT(\"\"&W28&\"!\"&$AB$1&$T33)","v":0},{"$f":"INDIRECT(\"\"&W28&\"!\"&$AC$1&$T33)","v":0},{"$f":"INDIRECT(\"\"&W28&\"!\"&$AD$1&$T33)","v":0},{"$f":"INDIRECT(\"\"&W28&\"!\"&$AE$1&$T33)","v":0},{"$f":"INDIRECT(\"\"&W28&\"!\"&$AF$1&$T33)","v":0},0,0," ",null,{"$f":"INDIRECT(\"\"&AL28&\"!\"&$V$1&$T33)","v":0},{"$f":"INDIRECT(\"\"&AL28&\"!\"&$W$1&$T33)","v":0},{"$f":"INDIRECT(\"\"&AL28&\"!\"&$X$1&$T33)","v":0},{"$f":"INDIRECT(\"\"&AL28&\"!\"&$Y$1&$T33)","v":0},{"$f":"INDIRECT(\"\"&AL28&\"!\"&$Z$1&$T33)","v":1},{"$f":"INDIRECT(\"\"&AL28&\"!\"&$AA$1&$T33)","v":0},{"$f":"INDIRECT(\"\"&AL28&\"!\"&$AB$1&$T33)","v":0},{"$f":"INDIRECT(\"\"&AL28&\"!\"&$AC$1&$T33)","v":0},{"$f":"INDIRECT(\"\"&AL28&\"!\"&$AD$1&$T33)","v":0},{"$f":"INDIRECT(\"\"&AL28&\"!\"&$AE$1&$T33)","v":0},{"$f":"INDIRECT(\"\"&AL28&\"!\"&$AF$1&$T33)","v":0},0,0," ",null,{"$f":"INDIRECT(\"\"&BA28&\"!\"&$V$1&$T33)","v":0},{"$f":"INDIRECT(\"\"&BA28&\"!\"&$W$1&$T33)","v":0},{"$f":"INDIRECT(\"\"&BA28&\"!\"&$X$1&$T33)","v":0},{"$f":"INDIRECT(\"\"&BA28&\"!\"&$Y$1&$T33)","v":0},{"$f":"INDIRECT(\"\"&BA28&\"!\"&$Z$1&$T33)","v":1},{"$f":"INDIRECT(\"\"&BA28&\"!\"&$AA$1&$T33)","v":0},{"$f":"INDIRECT(\"\"&BA28&\"!\"&$AB$1&$T33)","v":0},{"$f":"INDIRECT(\"\"&BA28&\"!\"&$AC$1&$T33)","v":0},{"$f":"INDIRECT(\"\"&BA28&\"!\"&$AD$1&$T33)","v":0},{"$f":"INDIRECT(\"\"&BA28&\"!\"&$AE$1&$T33)","v":0},{"$f":"INDIRECT(\"\"&BA28&\"!\"&$AF$1&$T33)","v":0},0,0," ",null,{"$f":"INDIRECT(\"\"&BP28&\"!\"&$V$1&$T33)","v":0},{"$f":"INDIRECT(\"\"&BP28&\"!\"&$W$1&$T33)","v":0},{"$f":"INDIRECT(\"\"&BP28&\"!\"&$X$1&$T33)","v":0},{"$f":"INDIRECT(\"\"&BP28&\"!\"&$Y$1&$T33)","v":0},{"$f":"INDIRECT(\"\"&BP28&\"!\"&$Z$1&$T33)","v":1},{"$f":"INDIRECT(\"\"&BP28&\"!\"&$AA$1&$T33)","v":0},{"$f":"INDIRECT(\"\"&BP28&\"!\"&$AB$1&$T33)","v":0},{"$f":"INDIRECT(\"\"&BP28&\"!\"&$AC$1&$T33)","v":0},{"$f":"INDIRECT(\"\"&BP28&\"!\"&$AD$1&$T33)","v":0},{"$f":"INDIRECT(\"\"&BP28&\"!\"&$AE$1&$T33)","v":0},{"$f":"INDIRECT(\"\"&BP28&\"!\"&$AF$1&$T33)","v":0},0,0," "]
[null,"Quiz-3",0,0,0,null,{"$f":"AA8+AA21+AA34+AP8+AP21+AP34+BE8+BE21+BE34+BT8+BT21+BT34","v":0},0,0,0,0,0,0,0,null,null,null,null,null,12,null,{"$f":"INDIRECT(\"\"&W28&\"!\"&$V$1&$T34)","v":"Quiz-3"},{"$f":"INDIRECT(\"\"&W28&\"!\"&$W$1&$T34)","v":0},{"$f":"INDIRECT(\"\"&W28&\"!\"&$X$1&$T34)","v":0},{"$f":"INDIRECT(\"\"&W28&\"!\"&$Y$1&$T34)","v":0},{"$f":"INDIRECT(\"\"&W28&\"!\"&$Z$1&$T34)","v":1},{"$f":"INDIRECT(\"\"&W28&\"!\"&$AA$1&$T34)","v":0},{"$f":"INDIRECT(\"\"&W28&\"!\"&$AB$1&$T34)","v":0},{"$f":"INDIRECT(\"\"&W28&\"!\"&$AC$1&$T34)","v":0},{"$f":"INDIRECT(\"\"&W28&\"!\"&$AD$1&$T34)","v":0},{"$f":"INDIRECT(\"\"&W28&\"!\"&$AE$1&$T34)","v":0},{"$f":"INDIRECT(\"\"&W28&\"!\"&$AF$1&$T34)","v":0},0,0," ",null,{"$f":"INDIRECT(\"\"&AL28&\"!\"&$V$1&$T34)","v":"Quiz-3"},{"$f":"INDIRECT(\"\"&AL28&\"!\"&$W$1&$T34)","v":0},{"$f":"INDIRECT(\"\"&AL28&\"!\"&$X$1&$T34)","v":0},{"$f":"INDIRECT(\"\"&AL28&\"!\"&$Y$1&$T34)","v":0},{"$f":"INDIRECT(\"\"&AL28&\"!\"&$Z$1&$T34)","v":1},{"$f":"INDIRECT(\"\"&AL28&\"!\"&$AA$1&$T34)","v":0},{"$f":"INDIRECT(\"\"&AL28&\"!\"&$AB$1&$T34)","v":0},{"$f":"INDIRECT(\"\"&AL28&\"!\"&$AC$1&$T34)","v":0},{"$f":"INDIRECT(\"\"&AL28&\"!\"&$AD$1&$T34)","v":0},{"$f":"INDIRECT(\"\"&AL28&\"!\"&$AE$1&$T34)","v":0},{"$f":"INDIRECT(\"\"&AL28&\"!\"&$AF$1&$T34)","v":0},0,0," ",null,{"$f":"INDIRECT(\"\"&BA28&\"!\"&$V$1&$T34)","v":"Quiz-3"},{"$f":"INDIRECT(\"\"&BA28&\"!\"&$W$1&$T34)","v":0},{"$f":"INDIRECT(\"\"&BA28&\"!\"&$X$1&$T34)","v":0},{"$f":"INDIRECT(\"\"&BA28&\"!\"&$Y$1&$T34)","v":0},{"$f":"INDIRECT(\"\"&BA28&\"!\"&$Z$1&$T34)","v":1},{"$f":"INDIRECT(\"\"&BA28&\"!\"&$AA$1&$T34)","v":0},{"$f":"INDIRECT(\"\"&BA28&\"!\"&$AB$1&$T34)","v":0},{"$f":"INDIRECT(\"\"&BA28&\"!\"&$AC$1&$T34)","v":0},{"$f":"INDIRECT(\"\"&BA28&\"!\"&$AD$1&$T34)","v":0},{"$f":"INDIRECT(\"\"&BA28&\"!\"&$AE$1&$T34)","v":0},{"$f":"INDIRECT(\"\"&BA28&\"!\"&$AF$1&$T34)","v":0},0,0," ",null,{"$f":"INDIRECT(\"\"&BP28&\"!\"&$V$1&$T34)","v":"Quiz-3"},{"$f":"INDIRECT(\"\"&BP28&\"!\"&$W$1&$T34)","v":0},{"$f":"INDIRECT(\"\"&BP28&\"!\"&$X$1&$T34)","v":0},{"$f":"INDIRECT(\"\"&BP28&\"!\"&$Y$1&$T34)","v":0},{"$f":"INDIRECT(\"\"&BP28&\"!\"&$Z$1&$T34)","v":1},{"$f":"INDIRECT(\"\"&BP28&\"!\"&$AA$1&$T34)","v":0},{"$f":"INDIRECT(\"\"&BP28&\"!\"&$AB$1&$T34)","v":0},{"$f":"INDIRECT(\"\"&BP28&\"!\"&$AC$1&$T34)","v":0},{"$f":"INDIRECT(\"\"&BP28&\"!\"&$AD$1&$T34)","v":0},{"$f":"INDIRECT(\"\"&BP28&\"!\"&$AE$1&$T34)","v":0},{"$f":"INDIRECT(\"\"&BP28&\"!\"&$AF$1&$T34)","v":0},0,0," "]
[null,0,0,0,0,null,{"$f":"AA9+AA22+AA35+AP9+AP22+AP35+BE9+BE22+BE35+BT9+BT22+BT35","v":0},0,0,0,0,0,0,0,null,null,null,null,null,13,null,{"$f":"INDIRECT(\"\"&W28&\"!\"&$V$1&$T35)","v":0},{"$f":"INDIRECT(\"\"&W28&\"!\"&$W$1&$T35)","v":0},{"$f":"INDIRECT(\"\"&W28&\"!\"&$X$1&$T35)","v":0},{"$f":"INDIRECT(\"\"&W28&\"!\"&$Y$1&$T35)","v":0},{"$f":"INDIRECT(\"\"&W28&\"!\"&$Z$1&$T35)","v":1},{"$f":"INDIRECT(\"\"&W28&\"!\"&$AA$1&$T35)","v":0},{"$f":"INDIRECT(\"\"&W28&\"!\"&$AB$1&$T35)","v":0},{"$f":"INDIRECT(\"\"&W28&\"!\"&$AC$1&$T35)","v":0},{"$f":"INDIRECT(\"\"&W28&\"!\"&$AD$1&$T35)","v":0},{"$f":"INDIRECT(\"\"&W28&\"!\"&$AE$1&$T35)","v":0},{"$f":"INDIRECT(\"\"&W28&\"!\"&$AF$1&$T35)","v":0},0,0," ",null,{"$f":"INDIRECT(\"\"&AL28&\"!\"&$V$1&$T35)","v":0},{"$f":"INDIRECT(\"\"&AL28&\"!\"&$W$1&$T35)","v":0},{"$f":"INDIRECT(\"\"&AL28&\"!\"&$X$1&$T35)","v":0},{"$f":"INDIRECT(\"\"&AL28&\"!\"&$Y$1&$T35)","v":0},{"$f":"INDIRECT(\"\"&AL28&\"!\"&$Z$1&$T35)","v":1},{"$f":"INDIRECT(\"\"&AL28&\"!\"&$AA$1&$T35)","v":0},{"$f":"INDIRECT(\"\"&AL28&\"!\"&$AB$1&$T35)","v":0},{"$f":"INDIRECT(\"\"&AL28&\"!\"&$AC$1&$T35)","v":0},{"$f":"INDIRECT(\"\"&AL28&\"!\"&$AD$1&$T35)","v":0},{"$f":"INDIRECT(\"\"&AL28&\"!\"&$AE$1&$T35)","v":0},{"$f":"INDIRECT(\"\"&AL28&\"!\"&$AF$1&$T35)","v":0},0,0," ",null,{"$f":"INDIRECT(\"\"&BA28&\"!\"&$V$1&$T35)","v":0},{"$f":"INDIRECT(\"\"&BA28&\"!\"&$W$1&$T35)","v":0},{"$f":"INDIRECT(\"\"&BA28&\"!\"&$X$1&$T35)","v":0},{"$f":"INDIRECT(\"\"&BA28&\"!\"&$Y$1&$T35)","v":0},{"$f":"INDIRECT(\"\"&BA28&\"!\"&$Z$1&$T35)","v":1},{"$f":"INDIRECT(\"\"&BA28&\"!\"&$AA$1&$T35)","v":0},{"$f":"INDIRECT(\"\"&BA28&\"!\"&$AB$1&$T35)","v":0},{"$f":"INDIRECT(\"\"&BA28&\"!\"&$AC$1&$T35)","v":0},{"$f":"INDIRECT(\"\"&BA28&\"!\"&$AD$1&$T35)","v":0},{"$f":"INDIRECT(\"\"&BA28&\"!\"&$AE$1&$T35)","v":0},{"$f":"INDIRECT(\"\"&BA28&\"!\"&$AF$1&$T35)","v":0},0,0," ",null,{"$f":"INDIRECT(\"\"&BP28&\"!\"&$V$1&$T35)","v":0},{"$f":"INDIRECT(\"\"&BP28&\"!\"&$W$1&$T35)","v":0},{"$f":"INDIRECT(\"\"&BP28&\"!\"&$X$1&$T35)","v":0},{"$f":"INDIRECT(\"\"&BP28&\"!\"&$Y$1&$T35)","v":0},{"$f":"INDIRECT(\"\"&BP28&\"!\"&$Z$1&$T35)","v":1},{"$f":"INDIRECT(\"\"&BP28&\"!\"&$AA$1&$T35)","v":0},{"$f":"INDIRECT(\"\"&BP28&\"!\"&$AB$1&$T35)","v":0},{"$f":"INDIRECT(\"\"&BP28&\"!\"&$AC$1&$T35)","v":0},{"$f":"INDIRECT(\"\"&BP28&\"!\"&$AD$1&$T35)","v":0},{"$f":"INDIRECT(\"\"&BP28&\"!\"&$AE$1&$T35)","v":0},{"$f":"INDIRECT(\"\"&BP28&\"!\"&$AF$1&$T35)","v":0},0,0," "]
[null,"Quiz-4",0,0,0,null,{"$f":"AA10+AA23+AA36+AP10+AP23+AP36+BE10+BE23+BE36+BT10+BT23+BT36","v":0},0,0,0,0,0,0,0,null,null,null,null,null,14,null,{"$f":"INDIRECT(\"\"&W28&\"!\"&$V$1&$T36)","v":"Quiz-4"},{"$f":"INDIRECT(\"\"&W28&\"!\"&$W$1&$T36)","v":0},{"$f":"INDIRECT(\"\"&W28&\"!\"&$X$1&$T36)","v":0},{"$f":"INDIRECT(\"\"&W28&\"!\"&$Y$1&$T36)","v":0},{"$f":"INDIRECT(\"\"&W28&\"!\"&$Z$1&$T36)","v":1},{"$f":"INDIRECT(\"\"&W28&\"!\"&$AA$1&$T36)","v":0},{"$f":"INDIRECT(\"\"&W28&\"!\"&$AB$1&$T36)","v":0},{"$f":"INDIRECT(\"\"&W28&\"!\"&$AC$1&$T36)","v":0},{"$f":"INDIRECT(\"\"&W28&\"!\"&$AD$1&$T36)","v":0},{"$f":"INDIRECT(\"\"&W28&\"!\"&$AE$1&$T36)","v":0},{"$f":"INDIRECT(\"\"&W28&\"!\"&$AF$1&$T36)","v":0},0,0," ",null,{"$f":"INDIRECT(\"\"&AL28&\"!\"&$V$1&$T36)","v":"Quiz-4"},{"$f":"INDIRECT(\"\"&AL28&\"!\"&$W$1&$T36)","v":0},{"$f":"INDIRECT(\"\"&AL28&\"!\"&$X$1&$T36)","v":0},{"$f":"INDIRECT(\"\"&AL28&\"!\"&$Y$1&$T36)","v":0},{"$f":"INDIRECT(\"\"&AL28&\"!\"&$Z$1&$T36)","v":1},{"$f":"INDIRECT(\"\"&AL28&\"!\"&$AA$1&$T36)","v":0},{"$f":"INDIRECT(\"\"&AL28&\"!\"&$AB$1&$T36)","v":0},{"$f":"INDIRECT(\"\"&AL28&\"!\"&$AC$1&$T36)","v":0},{"$f":"INDIRECT(\"\"&AL28&\"!\"&$AD$1&$T36)","v":0},{"$f":"INDIRECT(\"\"&AL28&\"!\"&$AE$1&$T36)","v":0},{"$f":"INDIRECT(\"\"&AL28&\"!\"&$AF$1&$T36)","v":0},0,0," ",null,{"$f":"INDIRECT(\"\"&BA28&\"!\"&$V$1&$T36)","v":"Quiz-4"},{"$f":"INDIRECT(\"\"&BA28&\"!\"&$W$1&$T36)","v":0},{"$f":"INDIRECT(\"\"&BA28&\"!\"&$X$1&$T36)","v":0},{"$f":"INDIRECT(\"\"&BA28&\"!\"&$Y$1&$T36)","v":0},{"$f":"INDIRECT(\"\"&BA28&\"!\"&$Z$1&$T36)","v":1},{"$f":"INDIRECT(\"\"&BA28&\"!\"&$AA$1&$T36)","v":0},{"$f":"INDIRECT(\"\"&BA28&\"!\"&$AB$1&$T36)","v":0},{"$f":"INDIRECT(\"\"&BA28&\"!\"&$AC$1&$T36)","v":0},{"$f":"INDIRECT(\"\"&BA28&\"!\"&$AD$1&$T36)","v":0},{"$f":"INDIRECT(\"\"&BA28&\"!\"&$AE$1&$T36)","v":0},{"$f":"INDIRECT(\"\"&BA28&\"!\"&$AF$1&$T36)","v":0},0,0," ",null,{"$f":"INDIRECT(\"\"&BP28&\"!\"&$V$1&$T36)","v":"Quiz-4"},{"$f":"INDIRECT(\"\"&BP28&\"!\"&$W$1&$T36)","v":0},{"$f":"INDIRECT(\"\"&BP28&\"!\"&$X$1&$T36)","v":0},{"$f":"INDIRECT(\"\"&BP28&\"!\"&$Y$1&$T36)","v":0},{"$f":"INDIRECT(\"\"&BP28&\"!\"&$Z$1&$T36)","v":1},{"$f":"INDIRECT(\"\"&BP28&\"!\"&$AA$1&$T36)","v":0},{"$f":"INDIRECT(\"\"&BP28&\"!\"&$AB$1&$T36)","v":0},{"$f":"INDIRECT(\"\"&BP28&\"!\"&$AC$1&$T36)","v":0},{"$f":"INDIRECT(\"\"&BP28&\"!\"&$AD$1&$T36)","v":0},{"$f":"INDIRECT(\"\"&BP28&\"!\"&$AE$1&$T36)","v":0},{"$f":"INDIRECT(\"\"&BP28&\"!\"&$AF$1&$T36)","v":0},0,0," "]
[null,0,0,0,0,null,{"$f":"AA11+AA24+AA37+AP11+AP24+AP37+BE11+BE24+BE37+BT11+BT24+BT37","v":0},0,0,0,0,0,0,0,null,null,null,null,null,15,null,{"$f":"INDIRECT(\"\"&W28&\"!\"&$V$1&$T37)","v":0},{"$f":"INDIRECT(\"\"&$W$28&\"!\"&$W$1&$T37)","v":0},{"$f":"INDIRECT(\"\"&W28&\"!\"&$X$1&$T37)","v":0},{"$f":"INDIRECT(\"\"&W28&\"!\"&$Y$1&$T37)","v":0},{"$f":"INDIRECT(\"\"&W28&\"!\"&$Z$1&$T37)","v":1},{"$f":"INDIRECT(\"\"&W28&\"!\"&$AA$1&$T37)","v":0},{"$f":"INDIRECT(\"\"&W28&\"!\"&$AB$1&$T37)","v":0},{"$f":"INDIRECT(\"\"&W28&\"!\"&$AC$1&$T37)","v":0},{"$f":"INDIRECT(\"\"&W28&\"!\"&$AD$1&$T37)","v":0},{"$f":"INDIRECT(\"\"&W28&\"!\"&$AE$1&$T37)","v":0},{"$f":"INDIRECT(\"\"&W28&\"!\"&$AF$1&$T37)","v":0},0,0," ",null,{"$f":"INDIRECT(\"\"&AL28&\"!\"&$V$1&$T37)","v":0},{"$f":"INDIRECT(\"\"&AL28&\"!\"&$W$1&$T37)","v":0},{"$f":"INDIRECT(\"\"&AL28&\"!\"&$X$1&$T37)","v":0},{"$f":"INDIRECT(\"\"&AL28&\"!\"&$Y$1&$T37)","v":0},{"$f":"INDIRECT(\"\"&AL28&\"!\"&$Z$1&$T37)","v":1},{"$f":"INDIRECT(\"\"&AL28&\"!\"&$AA$1&$T37)","v":0},{"$f":"INDIRECT(\"\"&AL28&\"!\"&$AB$1&$T37)","v":0},{"$f":"INDIRECT(\"\"&AL28&\"!\"&$AC$1&$T37)","v":0},{"$f":"INDIRECT(\"\"&AL28&\"!\"&$AD$1&$T37)","v":0},{"$f":"INDIRECT(\"\"&AL28&\"!\"&$AE$1&$T37)","v":0},{"$f":"INDIRECT(\"\"&AL28&\"!\"&$AF$1&$T37)","v":0},0,0," ",null,{"$f":"INDIRECT(\"\"&BA28&\"!\"&$V$1&$T37)","v":0},{"$f":"INDIRECT(\"\"&BA28&\"!\"&$W$1&$T37)","v":0},{"$f":"INDIRECT(\"\"&BA28&\"!\"&$X$1&$T37)","v":0},{"$f":"INDIRECT(\"\"&BA28&\"!\"&$Y$1&$T37)","v":0},{"$f":"INDIRECT(\"\"&BA28&\"!\"&$Z$1&$T37)","v":1},{"$f":"INDIRECT(\"\"&BA28&\"!\"&$AA$1&$T37)","v":0},{"$f":"INDIRECT(\"\"&BA28&\"!\"&$AB$1&$T37)","v":0},{"$f":"INDIRECT(\"\"&BA28&\"!\"&$AC$1&$T37)","v":0},{"$f":"INDIRECT(\"\"&BA28&\"!\"&$AD$1&$T37)","v":0},{"$f":"INDIRECT(\"\"&BA28&\"!\"&$AE$1&$T37)","v":0},{"$f":"INDIRECT(\"\"&BA28&\"!\"&$AF$1&$T37)","v":0},0,0," ",null,{"$f":"INDIRECT(\"\"&BP28&\"!\"&$V$1&$T37)","v":0},{"$f":"INDIRECT(\"\"&BP28&\"!\"&$W$1&$T37)","v":0},{"$f":"INDIRECT(\"\"&BP28&\"!\"&$X$1&$T37)","v":0},{"$f":"INDIRECT(\"\"&BP28&\"!\"&$Y$1&$T37)","v":0},{"$f":"INDIRECT(\"\"&BP28&\"!\"&$Z$1&$T37)","v":1},{"$f":"INDIRECT(\"\"&BP28&\"!\"&$AA$1&$T37)","v":0},{"$f":"INDIRECT(\"\"&BP28&\"!\"&$AB$1&$T37)","v":0},{"$f":"INDIRECT(\"\"&BP28&\"!\"&$AC$1&$T37)","v":0},{"$f":"INDIRECT(\"\"&BP28&\"!\"&$AD$1&$T37)","v":0},{"$f":"INDIRECT(\"\"&BP28&\"!\"&$AE$1&$T37)","v":0},{"$f":"INDIRECT(\"\"&BP28&\"!\"&$AF$1&$T37)","v":0},0,0," "]
[null,"Team Fouls",0,0,0,null,{"$f":"AA12+AA25+AA38+AP12+AP25+AP38+BE12+BE25+BE38+BT12+BT25+BT38","v":0},0,0,0,0,0,0,0,null,null,null,null,null,16,null,{"$f":"INDIRECT(\"\"&W28&\"!\"&$V$1&$T38)","v":"Team Fouls"},{"$f":"INDIRECT(\"\"&W28&\"!\"&$W$1&$T38)","v":0},null,null,null,null,null,null,null,null,null,null,null,null,null,{"$f":"INDIRECT(\"\"&AL28&\"!\"&$V$1&$T38)","v":"Team Fouls"},{"$f":"INDIRECT(\"\"&AL28&\"!\"&$W$1&$T38)","v":0},null,null,null,null,null,null,null,null,null,null,null,null,null,{"$f":"INDIRECT(\"\"&BA28&\"!\"&$V$1&$T38)","v":"Team Fouls"},{"$f":"INDIRECT(\"\"&BA28&\"!\"&$W$1&$T38)","v":0},null,null,null,null,null,null,null,null,null,null,null,null,null,{"$f":"INDIRECT(\"\"&BP28&\"!\"&$V$1&$T38)","v":"Team Fouls"},{"$f":"INDIRECT(\"\"&BP28&\"!\"&$W$1&$T38)","v":0}]
[null,"Total",{"$f":"SUM(C30:C38)","v":0},{"$f":"SUM(D30:D38)","v":0},{"$f":"SUM(E30:E38)","v":0},null,{"$f":"SUM(G30:G38)","v":0},0,0,0,0,0,0,0,null,null,null,null,null,19,null,"Total",{"$f":"SUM(W30:W38)","v":0},{"$f":"SUM(X30:X37)","v":0},{"$f":"SUM(Y30:Y37)","v":0},{"$f":"SUM(Z30:Z37)","v":8},null,{"$f":"SUM(AB30:AB37)","v":0},0,0,0,0,0,{"$f":"SUM(AH30:AH37)","v":0},null,null,"Total",{"$f":"SUM(AL30:AL38)","v":0},{"$f":"SUM(AM30:AM37)","v":0},{"$f":"SUM(AN30:AN37)","v":0},{"$f":"SUM(AO30:AO37)","v":8},null,{"$f":"SUM(AQ30:AQ37)","v":0},0,0,0,0,0,{"$f":"SUM(AW30:AW37)","v":0},null,null,"Total",{"$f":"SUM(BA30:BA38)","v":0},{"$f":"SUM(BB30:BB37)","v":0},{"$f":"SUM(BC30:BC37)","v":0},{"$f":"SUM(BD30:BD37)","v":8},null,{"$f":"SUM(BF30:BF37)","v":0},0,0,0,0,0,{"$f":"SUM(BL30:BL37)","v":0},null,null,"Total",{"$f":"SUM(BP30:BP38)","v":0},{"$f":"SUM(BQ30:BQ37)","v":0},{"$f":"SUM(BR30:BR37)","v":0},{"$f":"SUM(BS30:BS37)","v":8},null,{"$f":"SUM(BU30:BU37)","v":0},0,0,0,0,0,{"$f":"SUM(CA30:CA37)","v":0}]
[null,null,null,null,null,null,null,null,null,null,null,null,null,null,null,null,null,null,null,28,null,{"$f":"INDIRECT(\"\"&$W28&\"!\"&$V$1&$T39)","v":"Green Team"},{"$f":"INDIRECT(\"\"&$W28&\"!\"&$W$1&$T40)","v":0},null,null,null,null,null,null,null,null,null,null,null,null,null,{"$f":"INDIRECT(\"\"&$AL28&\"!\"&$V$1&$T39)","v":"Green Team"},{"$f":"INDIRECT(\"\"&$AL28&\"!\"&$W$1&$T40)","v":0},null,null,null,null,null,null,null,null,null,null,null,null,null,{"$f":"INDIRECT(\"\"&$BA28&\"!\"&$V$1&$T39)","v":"Green Team"},{"$f":"INDIRECT(\"\"&$BA28&\"!\"&$W$1&$T40)","v":0},null,null,null,null,null,null,null,null,null,null,null,null,null,{"$f":"INDIRECT(\"\"&$BP28&\"!\"&$V$1&$T39)","v":"Green Team"},{"$f":"INDIRECT(\"\"&$BP28&\"!\"&$W$1&$T40)","v":0}]

{"sheet":"Data","index":13,"n_rows":38,"n_cols":50,"rows_kept":38,"cut":false,"hidden":false,"merged":[[0,0,1,8]]}
["These are Lists - Please Leave Alone",null,null,null,null,null,null,null,null,null,"Ver2",null,null,null,null,null,null,null,null,null,null,1]
[null,null,null,null,null,null,null,null,null,null,null,null,null,null,"Rgb-1","Rgb-2","Rgb-3",null,"Rgb-1","Rgb-2","Rgb-3",2]
["Points",null,"Clear Values",null,"Point10","Point20","Point30","pointall",null,"QUIZ Out!","Fizz Out#","Light","Dark",null,"Light","Light","Light",null,"Dark","Dark","Dark",3,null,null,null,null,null,null,null,null,null,null,null,null,null,null,null,null,null,null,null,null,null,null,null,null,null,null,null,"Wave Play"]
[null,null,null,null,null,null,null,null,"Number Greater than =",5,2,null,null,null,null,null,null,null,null,null,null,4,null,null,null,null,null,null,null,null,null,null,null,null,null,null,null,null,null,null,null,null,null,null,null,null,null,null,null,"Notify.wav"]
[10,null,"Yes to Clear",null,10,20,30,10,null,null,null,"Red","Red",null,252,233,217,null,251,112,101,5]
[20,null,"Not Clear",null,-5,-10,-15,20,null,null,null,"Green","Green",null,212,254,162,null,146,208,80,6]
[30,null,null,null,null,null,null,30,null,null,null,"Yellow","Yellow",null,255,255,143,null,255,255,0,7]
[null,null,null,null,null,null,null,-5,null,null,null,"Blue","Blue",null,197,217,241,null,83,141,213,8]
[null,null,null,null,null,null,null,-10,null,null,null,"Brown","Brown",null,250,191,143,null,226,107,10,9]
[null,null,null,null,null,null,null,-15,null,null,null,null,null,null,null,null,null,null,null,null,null,10]
[null,null,null,null,null,null,null,null,"Chimes.wav",null,null,"Negative","Negative",null,255,255,143,null,255,255,0,11]
[null,null,null,null,null,null,null,null,"Chord.wav",null,null,"Plus+5","Quiz Out",null,197,217,241,null,83,141,213,12]
[null,null,null,null,null,null,null,null,"Ding.wav",null,null,"Minus-2","Fizz Out",null,250,191,143,null,226,107,10,13]
[null,null,null,null,null,null,null,null,"Notify.wav",null,null,null,null,null,null,null,null,null,null,null,null,14]
[null,null,null,null,null,null,null,null,"Tada.wav",null,null,"TimeStart","Time Stop",null,0,255,0,null,0,0,0,"AE5",null,null,null,null,null,null,null,null,null,null,null,null,null,null,null,null,null,null,null,null,"Sound-On"]
[null,null,null,null,null,null,null,null,null,null,null,"TimeEnd",null,null,255,0,0,null,null,null,null,"AI5"]
[null,null,null,null,null,null,null,null,null,null,null,"FoulStart","Foul End",null,255,0,255,null,0,0,0]
[null,null,null,null,null,null,null,null,null,null,null,"White"]
[]
[]
[]
[]
[]
[]
[]
[]
[]
[]
[]
[]
[]
[]
[]
[]
[]
[null,null,null,null,null,null,null,null,null,null,null,null,null,null,null,null,null,null,null,null,"Sat  20-Apr-2013  08:27:37 AM"]
[]
[null,null,null,null,null,null,null,null,null,null,null,null,null,null,null,null,"08:27:37"]

{"sheet":"Info","index":14,"n_rows":37,"n_cols":2,"rows_kept":37,"cut":false,"hidden":false,"merged":[]}
["JBQ - Score Sheets for a Competition Match","Ver2"]
[]
["The latest Version can be found at http://www.RhyneCats.com/JBQ","RhyneCats JBQ Link"]
[]
["In the \"Round_1\"  Sheet - On the Top Side of Score Sheet - Key in Team Name and Quizzers"]
["Once the Quizzer Name is entered, it will copy to all the other sheets and Can Not be Moved"]
[]
["On each Score Sheet - Round 1 thru 15"]
["You can hit the <Red> or the <Green> to change your Teams Colors"]
["Once the names are entered"]
["You will need to key in Scores Only"]
["Key in only FROM Column C thru Y, key in Fouls in Column Z,  but do not key in BONUS POINTS Column AA"]
["Rows 6 for Scores "]
["Rows   8-17 = Score per Quizzer"]
["Rows 20-27 = Score per Quizzer"]
[]
["Hit the <Red> Button to turn the Top Team Red"]
["Hit the <Green> Button to turn the Top Team Green"]
["Hit the <Find Top Quizzer> Button to show the Top Quizzers"]
[]
["You can hit these buttons at any time"]
[]
["Column A6 shows the Current Question Number"]
["Hit the <10> Button for a 10 Point Score for the NEXT QUESTION"]
["Hit the <20> Button for a 20 Point Score for the NEXT QUESTION"]
["Hit the <30> Button for a 30 Point Score for the NEXT QUESTION"]
["Hit the <Back> Button to back-up one Question (If you hit the wrong button, you can just key in the correct value)"]
[]
["To <Clear Values > :"]
["Go to Column AM - Row 31"]
["Select 'Yes to Clear'"]
["Hit the <Clear Values>  button"]
["This will erase all of the scores and prepare the score sheet for new game"]
[]
["There are Score Sheets for Rounds 1 thru 12"]
["If you need more, you will have to provide other means"]
["But, I would hope 10 Rounds would be enough, and 12 would be a very long day"]